Test_openjdk17_hs_extended.openjdk_x86-64_mac
Started by upstream project "build-scripts/jobs/jdk17u/jdk17u-mac-x64-temurin" build number 550
originally caused by:
Started by upstream project "build-scripts/openjdk17-pipeline" build number 942
originally caused by:
Started by upstream project "build-scripts/utils/betaTrigger_17ea" build number 190
originally caused by:
Started by timer
Checking out git ${ADOPTOPENJDK_REPO} into /home/jenkins/.jenkins/workspace/Test_openjdk17_hs_extended.openjdk_x86-64_mac@script/7d272c0688f17ab4e5b2f6ce77a7dc9cf4df33ff05c3a95eddd38682ef795b79 to read aqa-tests/buildenv/jenkins/openjdk_tests
The recommended git tool is: git
No credentials specified
Wiping out workspace first.
Cloning the remote Git repository
Using shallow clone with depth 1
Cloning repository https://github.com/adoptium/aqa-tests.git
> git init /home/jenkins/.jenkins/workspace/Test_openjdk17_hs_extended.openjdk_x86-64_mac@script/7d272c0688f17ab4e5b2f6ce77a7dc9cf4df33ff05c3a95eddd38682ef795b79/aqa-tests # timeout=10
Fetching upstream changes from https://github.com/adoptium/aqa-tests.git
> git --version # timeout=10
> git --version # 'git version 2.35.1'
> git fetch --tags --force --progress --depth=1 -- https://github.com/adoptium/aqa-tests.git +refs/heads/*:refs/remotes/origin/* # timeout=60
> git config remote.origin.url https://github.com/adoptium/aqa-tests.git # timeout=10
> git config --add remote.origin.fetch +refs/heads/*:refs/remotes/origin/* # timeout=10
Avoid second fetch
> git rev-parse origin/master^{commit} # timeout=10
Checking out Revision 2ee9988dedef51534a8afdb15827167e389443b6 (origin/master)
> git config core.sparsecheckout # timeout=10
> git checkout -f 2ee9988dedef51534a8afdb15827167e389443b6 # timeout=10
Commit message: "add missing default test targets"
> git rev-list --no-walk 41691e667c0f639afdefd205d05d471c4358b421 # timeout=10
First time build. Skipping changelog.
[Pipeline] Start of Pipeline
[Pipeline] timestamps
[Pipeline] {
[Pipeline] echo
[2024-09-04T21:59:09.992Z] SPEC: osx_x86-64
[Pipeline] echo
[2024-09-04T21:59:09.993Z] LABEL: ci.role.test&&hw.arch.x86&&(sw.os.osx||sw.os.mac)
[Pipeline] stage
[Pipeline] { (Queue)
[Pipeline] nodesByLabel
[2024-09-04T21:59:10.001Z] Found a total of 10 nodes with the 'ci.role.test&&hw.arch.x86&&(sw.os.osx||sw.os.mac)' label
[Pipeline] echo
[2024-09-04T21:59:10.003Z] dynamicAgents: []
[Pipeline] node
[2024-09-04T21:59:25.007Z] Still waiting to schedule task
[2024-09-04T21:59:25.007Z] Waiting for next available executor on ‘ci.role.test&&hw.arch.x86&&(sw.os.osx||sw.os.mac)’
[2024-09-04T22:01:36.486Z] Running on test-macincloud-macos1201-x64-2 in /Users/jenkins/workspace/Test_openjdk17_hs_extended.openjdk_x86-64_mac
[Pipeline] {
[Pipeline] retry
[Pipeline] {
[Pipeline] timeout
[2024-09-04T22:01:36.514Z] Timeout set to expire in 1 hr 0 min
[Pipeline] {
[Pipeline] cleanWs
[2024-09-04T22:01:36.802Z] [WS-CLEANUP] Deleting project workspace...
[2024-09-04T22:01:36.802Z] [WS-CLEANUP] Deferred wipeout is disabled by the job configuration...
[2024-09-04T22:01:36.937Z] [WS-CLEANUP] done
[Pipeline] }
[Pipeline] // timeout
[Pipeline] checkout
[2024-09-04T22:01:37.096Z] The recommended git tool is: git
[2024-09-04T22:01:37.369Z] No credentials specified
[2024-09-04T22:01:37.505Z] Cloning the remote Git repository
[2024-09-04T22:01:37.371Z] Cloning repository https://github.com/adoptium/aqa-tests.git
[2024-09-04T22:01:37.372Z] > git init /Users/jenkins/workspace/Test_openjdk17_hs_extended.openjdk_x86-64_mac/aqa-tests # timeout=10
[2024-09-04T22:01:37.399Z] [WARNING] Reference path does not exist: /Users/jenkins/openjdk_cache
[2024-09-04T22:01:37.399Z] Fetching upstream changes from https://github.com/adoptium/aqa-tests.git
[2024-09-04T22:01:37.399Z] > git --version # timeout=10
[2024-09-04T22:01:37.414Z] > git --version # 'git version 2.32.0 (Apple Git-132)'
[2024-09-04T22:01:37.414Z] > git fetch --tags --force --progress -- https://github.com/adoptium/aqa-tests.git +refs/heads/*:refs/remotes/origin/* # timeout=10
[2024-09-04T22:01:39.943Z] > git config remote.origin.url https://github.com/adoptium/aqa-tests.git # timeout=10
[2024-09-04T22:01:39.960Z] > git config --add remote.origin.fetch +refs/heads/*:refs/remotes/origin/* # timeout=10
[2024-09-04T22:01:40.520Z] Avoid second fetch
[2024-09-04T22:01:40.674Z] Checking out Revision 2ee9988dedef51534a8afdb15827167e389443b6 (origin/master)
[2024-09-04T22:01:40.249Z] > git rev-parse origin/master^{commit} # timeout=10
[2024-09-04T22:01:40.404Z] > git config core.sparsecheckout # timeout=10
[2024-09-04T22:01:40.420Z] > git checkout -f 2ee9988dedef51534a8afdb15827167e389443b6 # timeout=10
[2024-09-04T22:01:42.536Z] Commit message: "add missing default test targets"
[Pipeline] }
[Pipeline] // retry
[Pipeline] load
[Pipeline] { (/Users/jenkins/workspace/Test_openjdk17_hs_extended.openjdk_x86-64_mac/aqa-tests/buildenv/jenkins/JenkinsfileBase)
[Pipeline] }
[Pipeline] // load
[Pipeline] timeout
[2024-09-04T22:01:44.927Z] Timeout set to expire in 1 day 1 hr
[Pipeline] {
[Pipeline] stage
[Pipeline] { (Setup)
[Pipeline] sh
[2024-09-04T22:01:46.454Z] + LC_TIME=C
[2024-09-04T22:01:46.454Z] + date '+%a, %d %b %Y %T %z'
[Pipeline] echo
[2024-09-04T22:01:47.008Z] PROCESSCATCH: Terminating any hung/left over test processes:
[Pipeline] sh
[2024-09-04T22:01:48.490Z] + aqa-tests/terminateTestProcesses.sh jenkins
[2024-09-04T22:01:48.491Z] Mac type machine.. do not terminate any remaining processes as Orka mac VMs are not process isolated, see: https://github.com/adoptium/aqa-tests/issues/4964
[Pipeline] sh
[2024-09-04T22:01:51.073Z] + printenv
[2024-09-04T22:01:51.073Z] JCK_GIT_BRANCH=master
[2024-09-04T22:01:51.073Z] DYNAMIC_COMPILE=false
[2024-09-04T22:01:51.073Z] JENKINS_NODE_COOKIE=0fb66100-b3d0-4144-a847-b642e6e9f1a4
[2024-09-04T22:01:51.073Z] OPENJ9_BRANCH=master
[2024-09-04T22:01:51.073Z] BUILD_URL=https://ci.adoptium.net/job/Test_openjdk17_hs_extended.openjdk_x86-64_mac/178/
[2024-09-04T22:01:51.073Z] DOCKER_REQUIRED=false
[2024-09-04T22:01:51.073Z] PARALLEL=Dynamic
[2024-09-04T22:01:51.073Z] SHELL=/bin/bash
[2024-09-04T22:01:51.074Z] HUDSON_SERVER_COOKIE=2d832652af5afba8
[2024-09-04T22:01:51.074Z] JOBSTARTTIME=Wed, 04 Sep 2024 17:01:45 -0500
[2024-09-04T22:01:51.074Z] STAGE_NAME=Setup
[2024-09-04T22:01:51.074Z] SSH_CLIENT=78.47.239.97 51648 22
[2024-09-04T22:01:51.074Z] TMPDIR=/var/folders/83/7mx9d_px0ll2kg28htvh8m_c0000gr/T/
[2024-09-04T22:01:51.074Z] BUILD_TAG=jenkins-Test_openjdk17_hs_extended.openjdk_x86-64_mac-178
[2024-09-04T22:01:51.074Z] SDK_RESOURCE=upstream
[2024-09-04T22:01:51.074Z] TIME_LIMIT=25
[2024-09-04T22:01:51.074Z] JDK_BOOT_DIR=/Library/Java/JavaVirtualMachines/jdk1.7.0_80.jdk/Contents/Home
[2024-09-04T22:01:51.074Z] NUM_PROCESSORS=8
[2024-09-04T22:01:51.074Z] EXTERNAL_TEST_CMD=mvn clean install
[2024-09-04T22:01:51.074Z] OPENJ9_REPO=https://github.com/eclipse-openj9/openj9.git
[2024-09-04T22:01:51.074Z] JAVA_MAIN_CLASS_16078=hudson.remoting.Launcher
[2024-09-04T22:01:51.074Z] WORKSPACE=/Users/jenkins/workspace/Test_openjdk17_hs_extended.openjdk_x86-64_mac
[2024-09-04T22:01:51.074Z] JOB_URL=https://ci.adoptium.net/job/Test_openjdk17_hs_extended.openjdk_x86-64_mac/
[2024-09-04T22:01:51.074Z] RUN_CHANGES_DISPLAY_URL=https://ci.adoptium.net/job/Test_openjdk17_hs_extended.openjdk_x86-64_mac/178/display/redirect?page=changes
[2024-09-04T22:01:51.074Z] JDK_BRANCH=jdk-17.0.13+6_adopt
[2024-09-04T22:01:51.074Z] ACTIVE_NODE_TIMEOUT=5
[2024-09-04T22:01:51.074Z] USER=jenkins
[2024-09-04T22:01:51.074Z] ADOPTOPENJDK_BRANCH=master
[2024-09-04T22:01:51.074Z] OPENJCEPLUS_GIT_BRANCH=semeru-java17
[2024-09-04T22:01:51.074Z] ARCHIVE_TEST_RESULTS=false
[2024-09-04T22:01:51.074Z] UPSTREAM_JOB_NAME=build-scripts/jobs/jdk17u/jdk17u-mac-x64-temurin
[2024-09-04T22:01:51.074Z] STF_OWNER_BRANCH=adoptium:master
[2024-09-04T22:01:51.074Z] LIGHT_WEIGHT_CHECKOUT=false
[2024-09-04T22:01:51.074Z] RUN_ARTIFACTS_DISPLAY_URL=https://ci.adoptium.net/job/Test_openjdk17_hs_extended.openjdk_x86-64_mac/178/display/redirect?page=artifacts
[2024-09-04T22:01:51.074Z] __CF_USER_TEXT_ENCODING=0x1F8:0:0
[2024-09-04T22:01:51.074Z] ORIGIN_JDK_VERSION=17
[2024-09-04T22:01:51.074Z] SETUP_JCK_RUN=false
[2024-09-04T22:01:51.074Z] PERSONAL_BUILD=false
[2024-09-04T22:01:51.074Z] TKG_OWNER_BRANCH=adoptium:master
[2024-09-04T22:01:51.074Z] RERUN_ITERATIONS=1
[2024-09-04T22:01:51.074Z] SPEC=osx_x86-64
[2024-09-04T22:01:51.074Z] TKG_ITERATIONS=1
[2024-09-04T22:01:51.074Z] JENKINS_HOME=/home/jenkins/.jenkins
[2024-09-04T22:01:51.074Z] ITERATIONS=1
[2024-09-04T22:01:51.074Z] PATH=/usr/bin:/bin:/usr/sbin:/sbin:/usr/local/bin/
[2024-09-04T22:01:51.074Z] LIB_DIR=/Users/jenkins/workspace/Test_openjdk17_hs_extended.openjdk_x86-64_mac/../../testDependency/lib
[2024-09-04T22:01:51.074Z] KEEP_REPORTDIR=true
[2024-09-04T22:01:51.074Z] RUN_DISPLAY_URL=https://ci.adoptium.net/job/Test_openjdk17_hs_extended.openjdk_x86-64_mac/178/display/redirect
[2024-09-04T22:01:51.074Z] _=/usr/bin/printenv
[2024-09-04T22:01:51.074Z] GENERATE_JOBS=true
[2024-09-04T22:01:51.074Z] PWD=/Users/jenkins/workspace/Test_openjdk17_hs_extended.openjdk_x86-64_mac
[2024-09-04T22:01:51.074Z] JAVA_HOME=/Library/Java/JavaVirtualMachines/jdk-17/Contents/Home
[2024-09-04T22:01:51.074Z] EXIT_FAILURE=false
[2024-09-04T22:01:51.074Z] HUDSON_URL=https://ci.adoptium.net/
[2024-09-04T22:01:51.074Z] EXTERNAL_REPO_BRANCH=master
[2024-09-04T22:01:51.074Z] JDK_VERSION=17
[2024-09-04T22:01:51.074Z] CUSTOMIZED_SDK_URL_CREDENTIAL_ID=eclipse_temurin_bot_email_and_token
[2024-09-04T22:01:51.074Z] OPENJ9_SYSTEMTEST_OWNER_BRANCH=eclipse:master
[2024-09-04T22:01:51.074Z] JOB_NAME=Test_openjdk17_hs_extended.openjdk_x86-64_mac
[2024-09-04T22:01:51.074Z] BUILD_DISPLAY_NAME=#178
[2024-09-04T22:01:51.074Z] USE_TESTENV_PROPERTIES=false
[2024-09-04T22:01:51.074Z] JENKINS_URL=https://ci.adoptium.net/
[2024-09-04T22:01:51.074Z] EXIT_SUCCESS=false
[2024-09-04T22:01:51.074Z] BUILD_ID=178
[2024-09-04T22:01:51.074Z] TEST_TIME=120
[2024-09-04T22:01:51.074Z] PLATFORM=x86-64_mac
[2024-09-04T22:01:51.074Z] JDK_IMPL=hotspot
[2024-09-04T22:01:51.074Z] JOB_BASE_NAME=Test_openjdk17_hs_extended.openjdk_x86-64_mac
[2024-09-04T22:01:51.074Z] RUN_TESTS_DISPLAY_URL=https://ci.adoptium.net/job/Test_openjdk17_hs_extended.openjdk_x86-64_mac/178/display/redirect?page=tests
[2024-09-04T22:01:51.074Z] SHLVL=3
[2024-09-04T22:01:51.074Z] AUTO_DETECT=true
[2024-09-04T22:01:51.074Z] HOME=/Users/jenkins
[2024-09-04T22:01:51.074Z] TAP_NAME=Test_openjdk17_hs_extended.openjdk_x86-64_mac.tap
[2024-09-04T22:01:51.074Z] CI=true
[2024-09-04T22:01:51.074Z] WORKSPACE_TMP=/Users/jenkins/workspace/Test_openjdk17_hs_extended.openjdk_x86-64_mac@tmp
[2024-09-04T22:01:51.074Z] EXECUTOR_NUMBER=0
[2024-09-04T22:01:51.074Z] JENKINS_SERVER_COOKIE=durable-1404f062972eab458723ef51935a25183ebe9bb8a897a4b15c84eb14276c0de4
[2024-09-04T22:01:51.074Z] NODE_LABELS=macos12 x86_64 ci.role.test test-macincloud-macos1201-x64-2 x64 x86 sw.os.osx hw.arch.x86 mac
[2024-09-04T22:01:51.074Z] SYSTEM_LIB_DIR=/Users/jenkins/workspace/Test_openjdk17_hs_extended.openjdk_x86-64_mac/../../testDependency/system_lib
[2024-09-04T22:01:51.074Z] BUILD_LIST=openjdk
[2024-09-04T22:01:51.074Z] TARGET=extended.openjdk
[2024-09-04T22:01:51.074Z] LOGNAME=jenkins
[2024-09-04T22:01:51.074Z] JDK_REPO=https://github.com/adoptium/jdk17u
[2024-09-04T22:01:51.074Z] ADOPTOPENJDK_SYSTEMTEST_OWNER_BRANCH=adoptium:master
[2024-09-04T22:01:51.074Z] HUDSON_HOME=/home/jenkins/.jenkins
[2024-09-04T22:01:51.074Z] SSH_CONNECTION=78.47.239.97 51648 216.39.74.140 22
[2024-09-04T22:01:51.074Z] UPSTREAM_JOB_NUMBER=550
[2024-09-04T22:01:51.074Z] NODE_NAME=test-macincloud-macos1201-x64-2
[2024-09-04T22:01:51.074Z] BUILD_NUMBER=178
[2024-09-04T22:01:51.074Z] JOB_DISPLAY_URL=https://ci.adoptium.net/job/Test_openjdk17_hs_extended.openjdk_x86-64_mac/display/redirect
[2024-09-04T22:01:51.074Z] KEEP_WORKSPACE=false
[2024-09-04T22:01:51.074Z] HUDSON_COOKIE=1e59c920-7fb1-4061-9c27-127364ccc75a
[2024-09-04T22:01:51.074Z] PERF_ROOT=/Users/jenkins/workspace/Test_openjdk17_hs_extended.openjdk_x86-64_mac/../../benchmarks
[2024-09-04T22:01:51.074Z] USE_JRE=false
[2024-09-04T22:01:51.074Z] TEST_JDK_HOME=/Users/jenkins/workspace/Test_openjdk17_hs_extended.openjdk_x86-64_mac/jdkbinary/j2sdk-image
[2024-09-04T22:01:51.074Z] ADOPTOPENJDK_REPO=https://github.com/adoptium/aqa-tests.git
[2024-09-04T22:01:51.074Z] OPENJCEPLUS_GIT_REPO=https://github.com/ibmruntimes/OpenJCEPlus.git
[Pipeline] timeout
[2024-09-04T22:01:51.483Z] Timeout set to expire in 1 hr 0 min
[Pipeline] {
[Pipeline] dir
[2024-09-04T22:01:51.498Z] Running in /Users/jenkins/workspace/Test_openjdk17_hs_extended.openjdk_x86-64_mac/jdkbinary
[Pipeline] {
[Pipeline] copyArtifacts
[2024-09-04T22:02:35.237Z] Copied 7 artifacts from "build-scripts » jobs » jdk17u » jdk17u-mac-x64-temurin" build number 550
[Pipeline] }
[Pipeline] // dir
[Pipeline] }
[Pipeline] // timeout
[Pipeline] echo
[2024-09-04T22:02:35.451Z] IS_SVT_TESTREPO is set to false
[Pipeline] dir
[2024-09-04T22:02:35.457Z] Running in /Users/jenkins/workspace/Test_openjdk17_hs_extended.openjdk_x86-64_mac
[Pipeline] {
[Pipeline] sshagent
[2024-09-04T22:02:35.203Z] $ ssh-agent
[2024-09-04T22:02:36.163Z] SSH_AUTH_SOCK=/var/folders/83/7mx9d_px0ll2kg28htvh8m_c0000gr/T//ssh-Mfn4sgGV7Dlz/agent.76129
[2024-09-04T22:02:36.163Z] SSH_AGENT_PID=76130
[2024-09-04T22:02:36.163Z] [ssh-agent] Started.
[Pipeline] {
[Pipeline] dir
[2024-09-04T22:02:36.175Z] Running in /Users/jenkins/workspace/Test_openjdk17_hs_extended.openjdk_x86-64_mac/aqa-tests
[Pipeline] {
[Pipeline] withCredentials
[2024-09-04T22:02:36.201Z] Masking supported pattern matches of $USERNAME or $PASSWORD
[Pipeline] {
[Pipeline] sh
[2024-09-04T22:02:37.703Z] ++ pwd
[2024-09-04T22:02:37.704Z] + ./get.sh -s /Users/jenkins/workspace/Test_openjdk17_hs_extended.openjdk_x86-64_mac/aqa-tests/.. -p x86-64_mac -r upstream -j 17 -i hotspot --clone_openj9 false --tkg_repo https://github.com/adoptium/TKG.git --tkg_branch master
[2024-09-04T22:02:37.704Z] TESTDIR: /Users/jenkins/workspace/Test_openjdk17_hs_extended.openjdk_x86-64_mac/aqa-tests
[2024-09-04T22:02:37.704Z] get jdk binary...
[2024-09-04T22:02:37.704Z] --sdkdir is set to upstream. Therefore, skip download jdk binary
[2024-09-04T22:02:37.704Z] Uncompressing file: OpenJDK17U-jdk_x64_mac_hotspot_17.0.13_6-ea.tar.gz ...
[2024-09-04T22:02:38.495Z] Uncompressing file: OpenJDK17U-jre_x64_mac_hotspot_17.0.13_6-ea.tar.gz ...
[2024-09-04T22:02:39.286Z] Uncompressing file: OpenJDK17U-static-libs_x64_mac_hotspot_17.0.13_6-ea.tar.gz ...
[2024-09-04T22:02:39.286Z] Uncompressing file: OpenJDK17U-testimage_x64_mac_hotspot_17.0.13_6-ea.tar.gz ...
[2024-09-04T22:02:40.078Z] Uncompressing OpenJDK17U-debugimage_x64_mac_hotspot_17.0.13_6-ea.tar.gz over ./j2sdk-image...
[2024-09-04T22:02:40.870Z] /Users/jenkins/workspace/Test_openjdk17_hs_extended.openjdk_x86-64_mac/jdkbinary/j2sdk-image/bin/java does not exist! Searching under TEST_JDK_HOME: /Users/jenkins/workspace/Test_openjdk17_hs_extended.openjdk_x86-64_mac/jdkbinary/j2sdk-image...
[2024-09-04T22:02:40.870Z] javac_path: /Users/jenkins/workspace/Test_openjdk17_hs_extended.openjdk_x86-64_mac/jdkbinary/j2sdk-image/Contents/Home/bin/javac
[2024-09-04T22:02:40.870Z] Run: /Users/jenkins/workspace/Test_openjdk17_hs_extended.openjdk_x86-64_mac/jdkbinary/j2sdk-image/Contents/Home/bin/java -version
[2024-09-04T22:02:40.870Z] =JAVA VERSION OUTPUT BEGIN=
[2024-09-04T22:02:41.661Z] openjdk version "17.0.13-beta" 2024-10-15
[2024-09-04T22:02:41.661Z] OpenJDK Runtime Environment Temurin-17.0.13+6-202409041934 (build 17.0.13-beta+6-ea)
[2024-09-04T22:02:41.661Z] OpenJDK 64-Bit Server VM Temurin-17.0.13+6-202409041934 (build 17.0.13-beta+6-ea, mixed mode)
[2024-09-04T22:02:41.661Z] =JAVA VERSION OUTPUT END=
[2024-09-04T22:02:41.661Z] get testKitGen...
[2024-09-04T22:02:41.661Z] git clone -q https://github.com/adoptium/TKG.git
[2024-09-04T22:02:42.453Z] git rev-parse master
[2024-09-04T22:02:42.453Z] git checkout -q -f 751ecc88b6b69ec079af4cf1a4c5536d62b8c54f
[2024-09-04T22:02:42.453Z] check adoptium repo and TKG repo SHA
[2024-09-04T22:02:42.453Z] /Users/jenkins/workspace/Test_openjdk17_hs_extended.openjdk_x86-64_mac/aqa-tests/TKG/scripts/getSHA.sh --repo_dir /Users/jenkins/workspace/Test_openjdk17_hs_extended.openjdk_x86-64_mac/aqa-tests --output_file /Users/jenkins/workspace/Test_openjdk17_hs_extended.openjdk_x86-64_mac/aqa-tests/TKG/SHA.txt
[2024-09-04T22:02:42.454Z] Check sha in /Users/jenkins/workspace/Test_openjdk17_hs_extended.openjdk_x86-64_mac/aqa-tests and store the info in /Users/jenkins/workspace/Test_openjdk17_hs_extended.openjdk_x86-64_mac/aqa-tests/TKG/SHA.txt
[2024-09-04T22:02:42.454Z] touch /Users/jenkins/workspace/Test_openjdk17_hs_extended.openjdk_x86-64_mac/aqa-tests/TKG/SHA.txt
[2024-09-04T22:02:42.454Z] ================================================
[2024-09-04T22:02:42.454Z] timestamp: 20240904-170241
[2024-09-04T22:02:42.454Z] repo dir: /Users/jenkins/workspace/Test_openjdk17_hs_extended.openjdk_x86-64_mac/aqa-tests
[2024-09-04T22:02:42.454Z] git repo:
[2024-09-04T22:02:42.454Z] Fetch URL: https://github.com/adoptium/aqa-tests.git
[2024-09-04T22:02:42.454Z] sha:
[2024-09-04T22:02:42.454Z] 2ee9988dedef51534a8afdb15827167e389443b6
[2024-09-04T22:02:42.454Z] /Users/jenkins/workspace/Test_openjdk17_hs_extended.openjdk_x86-64_mac/aqa-tests/TKG/scripts/getTestenvProperties.sh --repo_dir /Users/jenkins/workspace/Test_openjdk17_hs_extended.openjdk_x86-64_mac/aqa-tests --output_file /Users/jenkins/workspace/Test_openjdk17_hs_extended.openjdk_x86-64_mac/aqa-tests/testenv/testenv.properties --repo_name ADOPTOPENJDK
[2024-09-04T22:02:42.454Z] Check sha in /Users/jenkins/workspace/Test_openjdk17_hs_extended.openjdk_x86-64_mac/aqa-tests and store the info in /Users/jenkins/workspace/Test_openjdk17_hs_extended.openjdk_x86-64_mac/aqa-tests/testenv/testenv.properties
[2024-09-04T22:02:42.454Z] ADOPTOPENJDK_REPO=https://github.com/adoptium/aqa-tests.git
[2024-09-04T22:02:42.454Z] ADOPTOPENJDK_BRANCH=2ee9988dedef51534a8afdb15827167e389443b6
[2024-09-04T22:02:42.454Z] /Users/jenkins/workspace/Test_openjdk17_hs_extended.openjdk_x86-64_mac/aqa-tests/TKG/scripts/getSHA.sh --repo_dir /Users/jenkins/workspace/Test_openjdk17_hs_extended.openjdk_x86-64_mac/aqa-tests/TKG --output_file /Users/jenkins/workspace/Test_openjdk17_hs_extended.openjdk_x86-64_mac/aqa-tests/TKG/SHA.txt
[2024-09-04T22:02:42.455Z] Check sha in /Users/jenkins/workspace/Test_openjdk17_hs_extended.openjdk_x86-64_mac/aqa-tests/TKG and store the info in /Users/jenkins/workspace/Test_openjdk17_hs_extended.openjdk_x86-64_mac/aqa-tests/TKG/SHA.txt
[2024-09-04T22:02:42.455Z] ================================================
[2024-09-04T22:02:42.455Z] timestamp: 20240904-170241
[2024-09-04T22:02:42.455Z] repo dir: /Users/jenkins/workspace/Test_openjdk17_hs_extended.openjdk_x86-64_mac/aqa-tests/TKG
[2024-09-04T22:02:42.455Z] git repo:
[2024-09-04T22:02:42.455Z] Fetch URL: https://github.com/adoptium/TKG.git
[2024-09-04T22:02:42.455Z] sha:
[2024-09-04T22:02:42.455Z] 751ecc88b6b69ec079af4cf1a4c5536d62b8c54f
[2024-09-04T22:02:42.455Z] /Users/jenkins/workspace/Test_openjdk17_hs_extended.openjdk_x86-64_mac/aqa-tests/TKG/scripts/getTestenvProperties.sh --repo_dir /Users/jenkins/workspace/Test_openjdk17_hs_extended.openjdk_x86-64_mac/aqa-tests/TKG --output_file /Users/jenkins/workspace/Test_openjdk17_hs_extended.openjdk_x86-64_mac/aqa-tests/testenv/testenv.properties --repo_name TKG
[2024-09-04T22:02:42.455Z] Check sha in /Users/jenkins/workspace/Test_openjdk17_hs_extended.openjdk_x86-64_mac/aqa-tests/TKG and store the info in /Users/jenkins/workspace/Test_openjdk17_hs_extended.openjdk_x86-64_mac/aqa-tests/testenv/testenv.properties
[2024-09-04T22:02:42.455Z] TKG_REPO=https://github.com/adoptium/TKG.git
[2024-09-04T22:02:42.455Z] TKG_BRANCH=751ecc88b6b69ec079af4cf1a4c5536d62b8c54f
[Pipeline] }
[Pipeline] // withCredentials
[Pipeline] }
[Pipeline] // dir
[Pipeline] }
[2024-09-04T22:02:42.638Z] $ ssh-agent -k
[2024-09-04T22:02:42.647Z] unset SSH_AUTH_SOCK;
[2024-09-04T22:02:42.647Z] unset SSH_AGENT_PID;
[2024-09-04T22:02:42.647Z] echo Agent pid 76130 killed;
[2024-09-04T22:02:43.593Z] [ssh-agent] Stopped.
[Pipeline] // sshagent
[Pipeline] fileExists
[Pipeline] echo
[2024-09-04T22:02:43.757Z] readProperties file: ./aqa-tests/job.properties
[Pipeline] readProperties
[Pipeline] echo
[2024-09-04T22:02:44.178Z] Reset TEST_JDK_HOME to /Users/jenkins/workspace/Test_openjdk17_hs_extended.openjdk_x86-64_mac/jdkbinary/j2sdk-image/Contents/Home/bin/../
[Pipeline] }
[Pipeline] // dir
[Pipeline] }
[Pipeline] // stage
[Pipeline] echo
[2024-09-04T22:02:44.467Z] Rerun in Grinder: https://ci.adoptium.net/job/Grinder/parambuild/?SDK_RESOURCE=upstream&TARGET=extended.openjdk&BASE_DOCKER_REGISTRY_CREDENTIAL_ID=&TEST_FLAG=&UPSTREAM_TEST_JOB_NAME=&DOCKER_REQUIRED=false&ACTIVE_NODE_TIMEOUT=5&VENDOR_TEST_DIRS=&EXTRA_DOCKER_ARGS=&TKG_OWNER_BRANCH=adoptium%3Amaster&OPENJ9_SYSTEMTEST_OWNER_BRANCH=eclipse%3Amaster&PLATFORM=x86-64_mac&GENERATE_JOBS=true&KEEP_REPORTDIR=true&PERSONAL_BUILD=false&DOCKER_REGISTRY_DIR=&RERUN_ITERATIONS=0&ADOPTOPENJDK_REPO=https%3A%2F%2Fgithub.com%2Fadoptium%2Faqa-tests.git&SETUP_JCK_RUN=false&DOCKER_REGISTRY_URL_CREDENTIAL_ID=&LABEL=&EXTRA_OPTIONS=&CUSTOMIZED_SDK_URL=&BUILD_IDENTIFIER=&JENKINS_KEY=&ADOPTOPENJDK_BRANCH=master&LIGHT_WEIGHT_CHECKOUT=false&USE_JRE=false&ARTIFACTORY_SERVER=&KEEP_WORKSPACE=false&USER_CREDENTIALS_ID=&JDK_VERSION=17&DOCKER_REGISTRY_URL=&ITERATIONS=1&VENDOR_TEST_REPOS=&JDK_REPO=https%3A%2F%2Fgithub.com%2Fadoptium%2Fjdk17u&JCK_GIT_BRANCH=master&OPENJ9_BRANCH=master&OPENJ9_SHA=&JCK_GIT_REPO=&VENDOR_TEST_BRANCHES=&UPSTREAM_JOB_NAME=build-scripts%2Fjobs%2Fjdk17u%2Fjdk17u-mac-x64-temurin&OPENJ9_REPO=https%3A%2F%2Fgithub.com%2Feclipse-openj9%2Fopenj9.git&CLOUD_PROVIDER=&CUSTOM_TARGET=&VENDOR_TEST_SHAS=&JDK_BRANCH=jdk-17.0.13%2B6_adopt&LABEL_ADDITION=&ARTIFACTORY_REPO=&ARTIFACTORY_ROOT_DIR=&UPSTREAM_TEST_JOB_NUMBER=&DOCKERIMAGE_TAG=&TEST_TIME=120&JDK_IMPL=hotspot&SSH_AGENT_CREDENTIAL=&AUTO_DETECT=true&SLACK_CHANNEL=&DYNAMIC_COMPILE=false&RELATED_NODES=&ADOPTOPENJDK_SYSTEMTEST_OWNER_BRANCH=adoptium%3Amaster&APPLICATION_OPTIONS=&CUSTOMIZED_SDK_URL_CREDENTIAL_ID=eclipse_temurin_bot_email_and_token&ARCHIVE_TEST_RESULTS=false&NUM_MACHINES=&OPENJDK_SHA=&TRSS_URL=&USE_TESTENV_PROPERTIES=false&BUILD_LIST=openjdk&ADDITIONAL_ARTIFACTS_REQUIRED=&UPSTREAM_JOB_NUMBER=550&STF_OWNER_BRANCH=adoptium%3Amaster&TIME_LIMIT=25&JVM_OPTIONS=&PARALLEL=Dynamic
[Pipeline] echo
[2024-09-04T22:02:44.481Z] Rerun in Grinder on same machine: https://ci.adoptium.net/job/Grinder/parambuild/?SDK_RESOURCE=upstream&TARGET=extended.openjdk&BASE_DOCKER_REGISTRY_CREDENTIAL_ID=&TEST_FLAG=&UPSTREAM_TEST_JOB_NAME=&DOCKER_REQUIRED=false&ACTIVE_NODE_TIMEOUT=5&VENDOR_TEST_DIRS=&EXTRA_DOCKER_ARGS=&TKG_OWNER_BRANCH=adoptium%3Amaster&OPENJ9_SYSTEMTEST_OWNER_BRANCH=eclipse%3Amaster&PLATFORM=x86-64_mac&GENERATE_JOBS=true&KEEP_REPORTDIR=true&PERSONAL_BUILD=false&DOCKER_REGISTRY_DIR=&RERUN_ITERATIONS=0&ADOPTOPENJDK_REPO=https%3A%2F%2Fgithub.com%2Fadoptium%2Faqa-tests.git&SETUP_JCK_RUN=false&DOCKER_REGISTRY_URL_CREDENTIAL_ID=&LABEL=test-macincloud-macos1201-x64-2&EXTRA_OPTIONS=&CUSTOMIZED_SDK_URL=&BUILD_IDENTIFIER=&JENKINS_KEY=&ADOPTOPENJDK_BRANCH=master&LIGHT_WEIGHT_CHECKOUT=false&USE_JRE=false&ARTIFACTORY_SERVER=&KEEP_WORKSPACE=false&USER_CREDENTIALS_ID=&JDK_VERSION=17&DOCKER_REGISTRY_URL=&ITERATIONS=1&VENDOR_TEST_REPOS=&JDK_REPO=https%3A%2F%2Fgithub.com%2Fadoptium%2Fjdk17u&JCK_GIT_BRANCH=master&OPENJ9_BRANCH=master&OPENJ9_SHA=&JCK_GIT_REPO=&VENDOR_TEST_BRANCHES=&UPSTREAM_JOB_NAME=build-scripts%2Fjobs%2Fjdk17u%2Fjdk17u-mac-x64-temurin&OPENJ9_REPO=https%3A%2F%2Fgithub.com%2Feclipse-openj9%2Fopenj9.git&CLOUD_PROVIDER=&CUSTOM_TARGET=&VENDOR_TEST_SHAS=&JDK_BRANCH=jdk-17.0.13%2B6_adopt&LABEL_ADDITION=&ARTIFACTORY_REPO=&ARTIFACTORY_ROOT_DIR=&UPSTREAM_TEST_JOB_NUMBER=&DOCKERIMAGE_TAG=&TEST_TIME=120&JDK_IMPL=hotspot&SSH_AGENT_CREDENTIAL=&AUTO_DETECT=true&SLACK_CHANNEL=&DYNAMIC_COMPILE=false&RELATED_NODES=&ADOPTOPENJDK_SYSTEMTEST_OWNER_BRANCH=adoptium%3Amaster&APPLICATION_OPTIONS=&CUSTOMIZED_SDK_URL_CREDENTIAL_ID=eclipse_temurin_bot_email_and_token&ARCHIVE_TEST_RESULTS=false&NUM_MACHINES=&OPENJDK_SHA=&TRSS_URL=&USE_TESTENV_PROPERTIES=false&BUILD_LIST=openjdk&ADDITIONAL_ARTIFACTS_REQUIRED=&UPSTREAM_JOB_NUMBER=550&STF_OWNER_BRANCH=adoptium%3Amaster&TIME_LIMIT=25&JVM_OPTIONS=&PARALLEL=Dynamic
[Pipeline] stage
[Pipeline] { (setupParallelEnv)
[Pipeline] timeout
[2024-09-04T22:02:44.521Z] Timeout set to expire in 1 hr 0 min
[Pipeline] {
[Pipeline] copyArtifacts
[2024-09-04T22:02:45.360Z] Copied 1 artifact from "getTRSSOutput" build number 1521
[Pipeline] sh
[2024-09-04T22:02:46.858Z] + cd ./aqa-tests/TKG/resources/TRSS
[2024-09-04T22:02:46.858Z] + gzip -cd TRSSOutput.tar.gz
[2024-09-04T22:02:46.858Z] + tar xof -
[2024-09-04T22:02:46.858Z] + rm TRSSOutput.tar.gz
[Pipeline] }
[Pipeline] // timeout
[Pipeline] timeout
[2024-09-04T22:02:47.290Z] Timeout set to expire in 20 min
[Pipeline] {
[Pipeline] echo
[2024-09-04T22:02:47.308Z] Custom URL: https://ci.adoptium.net//job/test.getDependency/lastSuccessfulBuild/artifact/
[Pipeline] sh
[2024-09-04T22:02:48.791Z] + perl ./aqa-tests/TKG/scripts/getDependencies.pl -path /Users/jenkins/workspace/Test_openjdk17_hs_extended.openjdk_x86-64_mac/../../testDependency/lib -task default -customUrl https://ci.adoptium.net//job/test.getDependency/lastSuccessfulBuild/artifact/
[2024-09-04T22:02:48.791Z] --------------------------------------------
[2024-09-04T22:02:48.791Z] path is set to /Users/jenkins/workspace/Test_openjdk17_hs_extended.openjdk_x86-64_mac/../../testDependency/lib
[2024-09-04T22:02:48.791Z] task is set to default
[2024-09-04T22:02:48.791Z] dependencyList is set to all
[2024-09-04T22:02:48.791Z] --------------------------------------------
[2024-09-04T22:02:48.791Z] Starting download third party dependent jars
[2024-09-04T22:02:48.791Z] --------------------------------------------
[2024-09-04T22:02:48.791Z] downloading dependent third party jars to /Users/jenkins/workspace/Test_openjdk17_hs_extended.openjdk_x86-64_mac/../../testDependency/lib
[2024-09-04T22:02:48.791Z] /Users/jenkins/workspace/Test_openjdk17_hs_extended.openjdk_x86-64_mac/../../testDependency/lib/mockito-core.jar exists with correct hash, not downloading
[2024-09-04T22:02:48.791Z] /Users/jenkins/workspace/Test_openjdk17_hs_extended.openjdk_x86-64_mac/../../testDependency/lib/org.eclipse.osgi-3.16.100.jar exists with correct hash, not downloading
[2024-09-04T22:02:48.791Z] /Users/jenkins/workspace/Test_openjdk17_hs_extended.openjdk_x86-64_mac/../../testDependency/lib/jtreg_5_1_b01.tar.gz exists with correct hash, not downloading
[2024-09-04T22:02:48.791Z] /Users/jenkins/workspace/Test_openjdk17_hs_extended.openjdk_x86-64_mac/../../testDependency/lib/jcommander.jar exists with correct hash, not downloading
[2024-09-04T22:02:48.791Z] /Users/jenkins/workspace/Test_openjdk17_hs_extended.openjdk_x86-64_mac/../../testDependency/lib/objenesis.jar exists with correct hash, not downloading
[2024-09-04T22:02:48.791Z] /Users/jenkins/workspace/Test_openjdk17_hs_extended.openjdk_x86-64_mac/../../testDependency/lib/javassist.jar exists with correct hash, not downloading
[2024-09-04T22:02:48.791Z] /Users/jenkins/workspace/Test_openjdk17_hs_extended.openjdk_x86-64_mac/../../testDependency/lib/openj9jtregtimeouthandler.jar exists with correct hash, not downloading
[2024-09-04T22:02:48.791Z] /Users/jenkins/workspace/Test_openjdk17_hs_extended.openjdk_x86-64_mac/../../testDependency/lib/jtreg_7_4_1.tar.gz exists with correct hash, not downloading
[2024-09-04T22:02:48.791Z] /Users/jenkins/workspace/Test_openjdk17_hs_extended.openjdk_x86-64_mac/../../testDependency/lib/asm-all.jar exists with correct hash, not downloading
[2024-09-04T22:02:48.791Z] /Users/jenkins/workspace/Test_openjdk17_hs_extended.openjdk_x86-64_mac/../../testDependency/lib/jcstress-tests-all-20240222.jar exists with correct hash, not downloading
[2024-09-04T22:02:48.791Z] /Users/jenkins/workspace/Test_openjdk17_hs_extended.openjdk_x86-64_mac/../../testDependency/lib/byte-buddy-agent.jar exists with correct hash, not downloading
[2024-09-04T22:02:48.791Z] /Users/jenkins/workspace/Test_openjdk17_hs_extended.openjdk_x86-64_mac/../../testDependency/lib/json-simple.jar exists with correct hash, not downloading
[2024-09-04T22:02:48.791Z] downloading https://dlcdn.apache.org/maven/maven-3/3.9.8/binaries/apache-maven-3.9.8-bin.tar.gz
[2024-09-04T22:02:48.791Z] ERROR: downloading https://dlcdn.apache.org/maven/maven-3/3.9.8/binaries/apache-maven-3.9.8-bin.tar.gz failed, return code: 1792
[2024-09-04T22:02:48.791Z] % Total % Received % Xferd Average Speed Time Time Time Current
[2024-09-04T22:02:48.791Z] Dload Upload Total Spent Left Speed
[2024-09-04T22:02:48.791Z]
[2024-09-04T22:02:48.791Z] 0 0 0 0 0 0 0 0 --:--:-- --:--:-- --:--:-- 0
[2024-09-04T22:02:48.791Z] 0 0 0 0 0 0 0 0 --:--:-- --:--:-- --:--:-- 0
[2024-09-04T22:02:48.791Z] curl: (7) Failed to connect to dlcdn.apache.org port 443: Connection refused
[Pipeline] }
[Pipeline] // timeout
[Pipeline] echo
[2024-09-04T22:02:49.226Z] Exception: hudson.AbortException: script returned exit code 2
[Pipeline] echo
[2024-09-04T22:02:49.228Z] Cannot pre-stage test libs from /Users/jenkins/workspace/Test_openjdk17_hs_extended.openjdk_x86-64_mac/../../testDependency/lib on the machine. Skipping...
[Pipeline] nodesByLabel
[2024-09-04T22:02:49.244Z] Found a total of 10 nodes with the 'ci.role.test&&hw.arch.x86&&(sw.os.osx||sw.os.mac)' label
[Pipeline] sh
[2024-09-04T22:02:50.753Z] + cd ./aqa-tests/TKG
[2024-09-04T22:02:50.753Z] + make genParallelList TEST=extended.openjdk TEST_TIME=120 NUM_MACHINES=
[2024-09-04T22:02:50.753Z] JAVA_HOME is set to /Users/jenkins/workspace/Test_openjdk17_hs_extended.openjdk_x86-64_mac/jdkbinary/j2sdk-image/Contents/Home/bin/../
[2024-09-04T22:02:50.753Z] UNAME_OS is Darwin
[2024-09-04T22:02:50.753Z] LIB_DIR is set to /Users/jenkins/workspace/Test_openjdk17_hs_extended.openjdk_x86-64_mac/../../testDependency/lib
[2024-09-04T22:02:50.753Z] rm -f -r /Users/jenkins/workspace/Test_openjdk17_hs_extended.openjdk_x86-64_mac/aqa-tests/TKG/../TKG/output_compilation; \
[2024-09-04T22:02:50.753Z] mkdir -p /Users/jenkins/workspace/Test_openjdk17_hs_extended.openjdk_x86-64_mac/aqa-tests/TKG/../TKG/output_compilation; \
[2024-09-04T22:02:50.753Z] (ant -f ./scripts/build_tools.xml "-DTEST_JDK_HOME=/Users/jenkins/workspace/Test_openjdk17_hs_extended.openjdk_x86-64_mac/jdkbinary/j2sdk-image/Contents/Home/bin/../" "-DTEST_ROOT=/Users/jenkins/workspace/Test_openjdk17_hs_extended.openjdk_x86-64_mac/aqa-tests/TKG/.." "-DLIB_DIR=/Users/jenkins/workspace/Test_openjdk17_hs_extended.openjdk_x86-64_mac/../../testDependency/lib" 2>&1; echo $? ) | tee "/Users/jenkins/workspace/Test_openjdk17_hs_extended.openjdk_x86-64_mac/aqa-tests/TKG/../TKG/output_compilation/compilation.log"; \
[2024-09-04T22:02:50.753Z] if [ -z "$(tail -1 /Users/jenkins/workspace/Test_openjdk17_hs_extended.openjdk_x86-64_mac/aqa-tests/TKG/../TKG/output_compilation/compilation.log | grep 0)" ]; then perl scripts/moveDmp.pl --compileLogPath="/Users/jenkins/workspace/Test_openjdk17_hs_extended.openjdk_x86-64_mac/aqa-tests/TKG/../TKG/output_compilation/compilation.log" --testRoot="/Users/jenkins/workspace/Test_openjdk17_hs_extended.openjdk_x86-64_mac/aqa-tests/TKG/.."; false; else rm -f -r "/Users/jenkins/workspace/Test_openjdk17_hs_extended.openjdk_x86-64_mac/aqa-tests/TKG/../TKG/output_compilation"; fi
[2024-09-04T22:02:50.753Z] Buildfile: /Users/jenkins/workspace/Test_openjdk17_hs_extended.openjdk_x86-64_mac/aqa-tests/TKG/scripts/build_tools.xml
[2024-09-04T22:02:50.753Z]
[2024-09-04T22:02:50.753Z] build:
[2024-09-04T22:02:50.753Z]
[2024-09-04T22:02:50.753Z] clean:
[2024-09-04T22:02:50.753Z]
[2024-09-04T22:02:50.753Z] init:
[2024-09-04T22:02:50.753Z] [mkdir] Created dir: /Users/jenkins/workspace/Test_openjdk17_hs_extended.openjdk_x86-64_mac/aqa-tests/TKG/bin
[2024-09-04T22:02:50.753Z]
[2024-09-04T22:02:50.753Z] getDependentLibs:
[2024-09-04T22:02:51.543Z] [exec] --------------------------------------------
[2024-09-04T22:02:51.543Z] [exec] path is set to /Users/jenkins/workspace/Test_openjdk17_hs_extended.openjdk_x86-64_mac/../../testDependency/lib
[2024-09-04T22:02:51.543Z] [exec] task is set to default
[2024-09-04T22:02:51.543Z] [exec] dependencyList is set to json_simple
[2024-09-04T22:02:51.543Z] [exec] --------------------------------------------
[2024-09-04T22:02:51.543Z] [exec] Starting download third party dependent jars
[2024-09-04T22:02:51.543Z] [exec] --------------------------------------------
[2024-09-04T22:02:51.543Z] [exec] downloading dependent third party jars to /Users/jenkins/workspace/Test_openjdk17_hs_extended.openjdk_x86-64_mac/../../testDependency/lib
[2024-09-04T22:02:51.543Z] [exec] /Users/jenkins/workspace/Test_openjdk17_hs_extended.openjdk_x86-64_mac/../../testDependency/lib/json-simple.jar exists with correct hash, not downloading
[2024-09-04T22:02:51.543Z] [exec] downloaded dependent third party jars successfully
[2024-09-04T22:02:51.543Z]
[2024-09-04T22:02:51.543Z] compile:
[2024-09-04T22:02:51.543Z] [echo] Ant version is Apache Ant(TM) version 1.10.5 compiled on July 10 2018
[2024-09-04T22:02:51.543Z] [echo] ============COMPILER SETTINGS============
[2024-09-04T22:02:51.543Z] [echo] ===fork: yes
[2024-09-04T22:02:51.543Z] [echo] ===debug: on
[2024-09-04T22:02:51.543Z] [javac] Compiling 27 source files to /Users/jenkins/workspace/Test_openjdk17_hs_extended.openjdk_x86-64_mac/aqa-tests/TKG/bin
[2024-09-04T22:02:53.238Z] [javac] Note: /Users/jenkins/workspace/Test_openjdk17_hs_extended.openjdk_x86-64_mac/aqa-tests/TKG/src/org/openj9/envInfo/MachineInfo.java uses or overrides a deprecated API.
[2024-09-04T22:02:53.238Z] [javac] Note: Recompile with -Xlint:deprecation for details.
[2024-09-04T22:02:53.238Z]
[2024-09-04T22:02:53.238Z] dist:
[2024-09-04T22:02:53.238Z] [jar] Building jar: /Users/jenkins/workspace/Test_openjdk17_hs_extended.openjdk_x86-64_mac/aqa-tests/TKG/bin/TestKitGen.jar
[2024-09-04T22:02:53.238Z]
[2024-09-04T22:02:53.238Z] BUILD SUCCESSFUL
[2024-09-04T22:02:53.238Z] Total time: 2 seconds
[2024-09-04T22:02:53.238Z] 0
[2024-09-04T22:02:53.238Z] /Users/jenkins/workspace/Test_openjdk17_hs_extended.openjdk_x86-64_mac/jdkbinary/j2sdk-image/Contents/Home/bin/..//bin/java -cp ./bin/TestKitGen.jar org.openj9.envInfo.EnvDetector
[2024-09-04T22:02:53.238Z] Unfamiliar microArch detected in TKG. It will not be added in TKG microArch!
[2024-09-04T22:02:53.238Z] microArchOutput: cat: /proc/cpuinfo: No such file or directory
[2024-09-04T22:02:54.029Z] ****************************** MACHINE INFO ******************************
[2024-09-04T22:02:54.029Z] File path : /Users/jenkins/workspace/Test_openjdk17_hs_extended.openjdk_x86-64_mac/aqa-tests/TKG
[2024-09-04T22:02:54.029Z] Free Physical Memory Size : 201232384
[2024-09-04T22:02:54.029Z] Free space (bytes) : 17458237440
[2024-09-04T22:02:54.029Z] Total Physical Memory Size : 4294967296
[2024-09-04T22:02:54.029Z] Total space (bytes) : 128639262720
[2024-09-04T22:02:54.029Z] Usable space (bytes) : 17458237440
[2024-09-04T22:02:54.029Z] antVersion : Apache Ant(TM) version 1.10.5 compiled on July 10 2018
[2024-09-04T22:02:54.029Z] bashVersion :
[2024-09-04T22:02:54.029Z] GNU bash, version 3.2.57(1)-release (x86_64-apple-darwin21)
[2024-09-04T22:02:54.029Z] Copyright (C) 2007 Free Software Foundation, Inc.
[2024-09-04T22:02:54.029Z] cpuCores : 4
[2024-09-04T22:02:54.029Z] curlVersion :
[2024-09-04T22:02:54.029Z] curl 7.77.0 (x86_64-apple-darwin21.0) libcurl/7.77.0 (SecureTransport) LibreSSL/2.8.3 zlib/1.2.11 nghttp2/1.42.0
[2024-09-04T22:02:54.029Z] Release-Date: 2021-05-26
[2024-09-04T22:02:54.029Z] Protocols: dict file ftp ftps gopher gophers http https imap imaps ldap ldaps mqtt pop3 pop3s rtsp smb smbs smtp smtps telnet tftp
[2024-09-04T22:02:54.029Z] Features: alt-svc AsynchDNS GSS-API HSTS HTTP2 HTTPS-proxy IPv6 Kerberos Largefile libz MultiSSL NTLM NTLM_WB SPNEGO SSL UnixSockets
[2024-09-04T22:02:54.029Z] dockerVersion : bash: docker: command not found
[2024-09-04T22:02:54.029Z] gcc version : 13.1.6
[2024-09-04T22:02:54.029Z] gclibc version : bash: ldd: command not found
[2024-09-04T22:02:54.029Z] gdb version : bash: gdb: command not found
[2024-09-04T22:02:54.029Z] lldb version :
[2024-09-04T22:02:54.029Z] lldb-1316.0.9.41
[2024-09-04T22:02:54.029Z] Apple Swift version 5.6 (swiftlang-5.6.0.323.62 clang-1316.0.20.8)
[2024-09-04T22:02:54.029Z] makeVersion :
[2024-09-04T22:02:54.029Z] GNU Make 3.81
[2024-09-04T22:02:54.029Z] Copyright (C) 2006 Free Software Foundation, Inc.
[2024-09-04T22:02:54.029Z] This is free software; see the source for copying conditions.
[2024-09-04T22:02:54.029Z] There is NO warranty; not even for MERCHANTABILITY or FITNESS FOR A
[2024-09-04T22:02:54.029Z] PARTICULAR PURPOSE.
[2024-09-04T22:02:54.029Z]
[2024-09-04T22:02:54.029Z] This program built for i386-apple-darwin11.3.0
[2024-09-04T22:02:54.029Z] mavenVersion :
[2024-09-04T22:02:54.029Z] Apache Maven 3.6.3 (cecedd343002696d0abb50b32b541b8a6ba2883f)
[2024-09-04T22:02:54.029Z] Maven home: /usr/local/apache-maven-3.6.3
[2024-09-04T22:02:54.029Z] Java version: 17.0.13-beta, vendor: Eclipse Adoptium, runtime: /Users/jenkins/workspace/Test_openjdk17_hs_extended.openjdk_x86-64_mac/jdkbinary/j2sdk-image/Contents/Home
[2024-09-04T22:02:54.029Z] Default locale: en_US, platform encoding: UTF-8
[2024-09-04T22:02:54.029Z] OS name: "mac os x", version: "12.0.1", arch: "x86_64", family: "mac"
[2024-09-04T22:02:54.029Z] perlVersion :
[2024-09-04T22:02:54.029Z]
[2024-09-04T22:02:54.029Z] This is perl 5, version 30, subversion 3 (v5.30.3) built for darwin-thread-multi-2level
[2024-09-04T22:02:54.029Z] (with 2 registered patches, see perl -V for more detail)
[2024-09-04T22:02:54.029Z]
[2024-09-04T22:02:54.029Z] Copyright 1987-2020, Larry Wall
[2024-09-04T22:02:54.029Z]
[2024-09-04T22:02:54.029Z] Perl may be copied only under the terms of either the Artistic License or the
[2024-09-04T22:02:54.029Z] GNU General Public License, which may be found in the Perl 5 source kit.
[2024-09-04T22:02:54.029Z]
[2024-09-04T22:02:54.029Z] Complete documentation for Perl, including FAQ lists, should be found on
[2024-09-04T22:02:54.029Z] this system using "man perl" or "perldoc perl". If you have access to the
[2024-09-04T22:02:54.029Z] Internet, point your browser at http://www.perl.org/, the Perl Home Page.
[2024-09-04T22:02:54.029Z]
[2024-09-04T22:02:54.029Z] podmanVersion : bash: podman: command not found
[2024-09-04T22:02:54.029Z] procArch : i386
[2024-09-04T22:02:54.029Z] sysArch : x86_64
[2024-09-04T22:02:54.029Z] sysOS : Darwin
[2024-09-04T22:02:54.029Z] ulimit :
[2024-09-04T22:02:54.029Z] core file size (blocks, -c) 0
[2024-09-04T22:02:54.029Z] data seg size (kbytes, -d) unlimited
[2024-09-04T22:02:54.029Z] file size (blocks, -f) unlimited
[2024-09-04T22:02:54.029Z] max locked memory (kbytes, -l) unlimited
[2024-09-04T22:02:54.029Z] max memory size (kbytes, -m) unlimited
[2024-09-04T22:02:54.029Z] open files (-n) 2147483647
[2024-09-04T22:02:54.029Z] pipe size (512 bytes, -p) 1
[2024-09-04T22:02:54.029Z] stack size (kbytes, -s) 65532
[2024-09-04T22:02:54.029Z] cpu time (seconds, -t) unlimited
[2024-09-04T22:02:54.029Z] max user processes (-u) 1392
[2024-09-04T22:02:54.029Z] virtual memory (kbytes, -v) unlimited
[2024-09-04T22:02:54.029Z] uname : Darwin test-macincloud-macos1201-x64-2.adoptopenjdk.net 21.1.0 Darwin Kernel Version 21.1.0: Wed Oct 13 17:33:23 PDT 2021; root:xnu-8019.41.5~1/RELEASE_X86_64 x86_64
[2024-09-04T22:02:54.029Z] vmVendor : Oracle Corporation
[2024-09-04T22:02:54.029Z] vmVersion : 17.0.13-beta+6-ea
[2024-09-04T22:02:54.029Z] xlc version : bash: xlC: command not found
[2024-09-04T22:02:54.029Z] **************************************************************************
[2024-09-04T22:02:54.029Z]
[2024-09-04T22:02:54.029Z] System.getProperty('java.vm.name')=OpenJDK 64-Bit Server VM
[2024-09-04T22:02:54.029Z]
[2024-09-04T22:02:54.029Z] System.getProperty('java.vendor')=Eclipse Adoptium
[2024-09-04T22:02:54.029Z]
[2024-09-04T22:02:54.029Z] System.getProperty('os.name')=Mac OS X
[2024-09-04T22:02:54.029Z]
[2024-09-04T22:02:54.029Z] System.getProperty('os.arch')=x86_64
[2024-09-04T22:02:54.029Z]
[2024-09-04T22:02:54.029Z] System.getProperty('java.fullversion')=null
[2024-09-04T22:02:54.029Z]
[2024-09-04T22:02:54.029Z] System.getProperty('sun.arch.data.model')=64
[2024-09-04T22:02:54.029Z]
[2024-09-04T22:02:54.029Z] /Library/Developer/CommandLineTools/usr/bin/make -f makeGen.mk AUTO_DETECT=true MODE=parallelList NUM_MACHINES= TEST_TIME=120 TESTTARGET=extended.openjdk TESTLIST= TRSS_URL= LIB_DIR=/Users/jenkins/workspace/Test_openjdk17_hs_extended.openjdk_x86-64_mac/../../testDependency/lib
[2024-09-04T22:02:54.029Z] perl scripts/configure.pl
[2024-09-04T22:02:54.029Z] /Users/jenkins/workspace/Test_openjdk17_hs_extended.openjdk_x86-64_mac/jdkbinary/j2sdk-image/Contents/Home/bin/..//bin/java -cp "./bin/TestKitGen.jar:/Users/jenkins/workspace/Test_openjdk17_hs_extended.openjdk_x86-64_mac/../../testDependency/lib/json-simple.jar" org.testKitGen.MainRunner --mode=parallelList --spec=osx_x86-64 --microArch="" --osLabel="" --jdkVersion=17 --impl=hotspot --vendor="eclipse" --buildList=openjdk --iterations=1 --aotIterations= --testFlag= --testTarget=extended.openjdk --testList= --numOfMachines= --testTime=120 --TRSSURL=
[2024-09-04T22:02:54.029Z] Modes data parsed from resources/modes.xml and resources/ottawa.csv.
[2024-09-04T22:02:54.029Z]
[2024-09-04T22:02:54.029Z]
[2024-09-04T22:02:54.029Z] Starting to generate parallel test lists.
[2024-09-04T22:02:54.029Z]
[2024-09-04T22:02:54.029Z] Parsing /Users/jenkins/workspace/Test_openjdk17_hs_extended.openjdk_x86-64_mac/aqa-tests/TKG/../openjdk/playlist.xml
[2024-09-04T22:02:54.029Z] Attempting to get test duration data from TRSS.
[2024-09-04T22:02:54.029Z] curl --silent --max-time 120 -L -k https://trss.adoptopenjdk.net/api/getTestAvgDuration?limit=10&jdkVersion=17&impl=hs&platform=x86-64_mac&group=openjdk&level=extended
[2024-09-04T22:02:54.818Z] Attempting to get test duration data from cached files.
[2024-09-04T22:02:54.818Z]
[2024-09-04T22:02:54.818Z] TEST DURATION
[2024-09-04T22:02:54.818Z] ====================================================================================
[2024-09-04T22:02:54.818Z] Total number of tests searched: 83
[2024-09-04T22:02:54.818Z] Number of test durations found: 83
[2024-09-04T22:02:54.818Z] Top slowest tests:
[2024-09-04T22:02:54.818Z] 293m04s hotspot_compiler_0
[2024-09-04T22:02:54.818Z] 104m20s jdk_tools_1
[2024-09-04T22:02:54.818Z] 99m32s jdk_security3_0
[2024-09-04T22:02:54.818Z] ====================================================================================
[2024-09-04T22:02:54.818Z] Warning: Test hotspot_compiler_0 has duration 293m04s, which is greater than the specified test list execution time 7200000m. So this value is used to limit the overall execution time.
[2024-09-04T22:02:54.818Z]
[2024-09-04T22:02:54.818Z] Test target is split into 4 lists.
[2024-09-04T22:02:54.818Z] Reducing estimated test running time from 993m43s to 293m04s.
[2024-09-04T22:02:54.818Z]
[2024-09-04T22:02:54.818Z] -------------------------------------testList_0-------------------------------------
[2024-09-04T22:02:54.818Z] Number of tests: 1
[2024-09-04T22:02:54.818Z] Estimated running time: 293m04s
[2024-09-04T22:02:54.818Z] TESTLIST=hotspot_compiler_0
[2024-09-04T22:02:54.818Z] ------------------------------------------------------------------------------------
[2024-09-04T22:02:54.818Z]
[2024-09-04T22:02:54.818Z] -------------------------------------testList_1-------------------------------------
[2024-09-04T22:02:54.818Z] Number of tests: 3
[2024-09-04T22:02:54.818Z] Estimated running time: 288m45s
[2024-09-04T22:02:54.818Z] TESTLIST=jdk_tools_1,jdk_security3_0,jdk_net_0
[2024-09-04T22:02:54.818Z] ------------------------------------------------------------------------------------
[2024-09-04T22:02:54.818Z]
[2024-09-04T22:02:54.818Z] -------------------------------------testList_2-------------------------------------
[2024-09-04T22:02:54.818Z] Number of tests: 8
[2024-09-04T22:02:54.818Z] Estimated running time: 291m51s
[2024-09-04T22:02:54.818Z] TESTLIST=jdk_tools_0,jdk_security3_1,jdk_beans_0,jdk_net_1,jdk_nio_1,jdk_beans_1,jdk_jfr_1,jdk_nio_0
[2024-09-04T22:02:54.818Z] ------------------------------------------------------------------------------------
[2024-09-04T22:02:54.818Z]
[2024-09-04T22:02:54.818Z] -------------------------------------testList_3-------------------------------------
[2024-09-04T22:02:54.818Z] Number of tests: 71
[2024-09-04T22:02:54.818Z] Estimated running time: 120m02s
[2024-09-04T22:02:54.818Z] TESTLIST=jdk_jfr_0,jdk_jdi_0,jdk_jmx_0,jdk_jmx_1,jdk_jdi_1,jdk_management_0,jdk_time_0,jdk_vector_1,jdk_vector_0,jdk_time_1,jdk_other_1,jdk_other_0,jdk_text_0,jdk_instrument_1,jdk_rmi_0,jdk_io_0,jdk_rmi_1,jdk_instrument_0,jdk_management_1,jdk_io_1,jdk_text_1,hotspot_native_sanity_0,jdk_build_0,jdk_native_sanity_1,jdk_build_1,jdk_native_sanity_0,jdk_awt_0,jdk_nio_2,jdk_net_2,jdk_awt_1,jdk_awt_2,jdk_swing_2,jdk_beans_2,jdk_security3_2,jdk_2d_1,jdk_swing_1,jdk_swing_0,jdk_sound_0,jdk_sound_1,jdk_imageio_1,jdk_time_2,jdk_text_2,jdk_sound_2,jdk_management_2,jdk_imageio_2,jdk_imageio_0,jdk_other_2,jdk_security_infra_2,jdk_2d_2,jdk_client_sanity_1,jdk_client_sanity_0,jdk_2d_0,jdk_security_infra_1,jdk_security_infra_0,jdk_jfc_demo_1,jdk_client_sanity_2,jdk_jfc_demo_2,jdk_jfc_demo_0,jdk_jdi_2,jdk_jmx_2,jdk_io_2,jdk_tools_2,jdk_security_infra_zos_0,jdk_security_infra_zos_2,jdk_security_infra_zos_1,jdk_native_sanity_2,jdk_jfr_2,jdk_instrument_2,jdk_build_2,jdk_vector_2,jdk_rmi_2
[2024-09-04T22:02:54.818Z] ------------------------------------------------------------------------------------
[2024-09-04T22:02:54.818Z]
[2024-09-04T22:02:54.818Z] Parallel test lists file (/Users/jenkins/workspace/Test_openjdk17_hs_extended.openjdk_x86-64_mac/aqa-tests/TKG/../TKG/parallelList.mk) is generated successfully.
[Pipeline] fileExists
[Pipeline] echo
[2024-09-04T22:02:55.366Z] read parallelList.mk file: aqa-tests/TKG/parallelList.mk
[Pipeline] readProperties
[Pipeline] echo
[2024-09-04T22:02:55.778Z] Saving parallelList.mk file on jenkins...
[Pipeline] dir
[2024-09-04T22:02:55.782Z] Running in /Users/jenkins/workspace/Test_openjdk17_hs_extended.openjdk_x86-64_mac/aqa-tests/TKG
[Pipeline] {
[Pipeline] archiveArtifacts
[2024-09-04T22:02:55.936Z] Archiving artifacts
[2024-09-04T22:02:56.209Z] Recording fingerprints
[Pipeline] }
[Pipeline] // dir
[Pipeline] echo
[2024-09-04T22:02:56.394Z] [PARALLEL: Dynamic] childJobNum is 4, creating jobs and running them in parallel...
[Pipeline] parallel
[Pipeline] { (Branch: testList_0)
[Pipeline] { (Branch: testList_1)
[Pipeline] { (Branch: testList_2)
[Pipeline] { (Branch: testList_3)
[Pipeline] echo
[2024-09-04T22:02:57.049Z] GENERATE_JOBS is set to true, set test job Test_openjdk17_hs_extended.openjdk_x86-64_mac_testList_0 params for generating the job
[Pipeline] echo
[2024-09-04T22:02:57.050Z] GENERATE_JOBS is set to true, set test job Test_openjdk17_hs_extended.openjdk_x86-64_mac_testList_1 params for generating the job
[Pipeline] echo
[2024-09-04T22:02:57.051Z] GENERATE_JOBS is set to true, set test job Test_openjdk17_hs_extended.openjdk_x86-64_mac_testList_2 params for generating the job
[Pipeline] echo
[2024-09-04T22:02:57.052Z] GENERATE_JOBS is set to true, set test job Test_openjdk17_hs_extended.openjdk_x86-64_mac_testList_3 params for generating the job
[Pipeline] fileExists
[Pipeline] fileExists
[Pipeline] fileExists
[Pipeline] fileExists
[Pipeline] jobDsl
[Pipeline] jobDsl
[Pipeline] jobDsl
[Pipeline] jobDsl
[2024-09-04T22:02:57.894Z] Processing DSL script aqa-tests/buildenv/jenkins/testJobTemplate
[2024-09-04T22:02:57.900Z] Processing DSL script aqa-tests/buildenv/jenkins/testJobTemplate
[2024-09-04T22:02:58.030Z] Processing DSL script aqa-tests/buildenv/jenkins/testJobTemplate
[2024-09-04T22:02:58.031Z] Processing DSL script aqa-tests/buildenv/jenkins/testJobTemplate
[2024-09-04T22:06:29.707Z] LEVELS: [extended]
[2024-09-04T22:06:29.707Z] JDK_VERSIONS: [8]
[2024-09-04T22:06:29.707Z] GROUPS: [openjdk]
[2024-09-04T22:06:29.707Z] ARCH_OS_LIST: [x86-64_mac]
[2024-09-04T22:06:29.746Z] LEVELS: [extended]
[2024-09-04T22:06:29.746Z] JDK_VERSIONS: [8]
[2024-09-04T22:06:29.746Z] GROUPS: [openjdk]
[2024-09-04T22:06:29.746Z] ARCH_OS_LIST: [x86-64_mac]
[2024-09-04T22:06:29.870Z] LEVELS: [extended]
[2024-09-04T22:06:29.870Z] JDK_VERSIONS: [8]
[2024-09-04T22:06:29.870Z] GROUPS: [openjdk]
[2024-09-04T22:06:29.870Z] ARCH_OS_LIST: [x86-64_mac]
[2024-09-04T22:06:29.876Z] LEVELS: [extended]
[2024-09-04T22:06:29.876Z] JDK_VERSIONS: [8]
[2024-09-04T22:06:29.876Z] GROUPS: [openjdk]
[2024-09-04T22:06:29.876Z] ARCH_OS_LIST: [x86-64_mac]
[2024-09-04T22:06:29.895Z] Existing items:
[2024-09-04T22:06:29.895Z] GeneratedJob{name='Test_openjdk17_hs_extended.openjdk_x86-64_mac_testList_1'}
[2024-09-04T22:06:29.895Z] Unreferenced items:
[2024-09-04T22:06:29.895Z] GeneratedJob{name='Test_openjdk17_hs_extended.openjdk_x86-64_mac_rerun'}
[2024-09-04T22:06:29.895Z] GeneratedJob{name='Test_openjdk17_hs_extended.openjdk_x86-64_mac_testList_0'}
[2024-09-04T22:06:29.895Z] GeneratedJob{name='Test_openjdk17_hs_extended.openjdk_x86-64_mac_testList_2'}
[2024-09-04T22:06:29.895Z] GeneratedJob{name='Test_openjdk17_hs_extended.openjdk_x86-64_mac_testList_3'}
[2024-09-04T22:06:29.895Z] GeneratedJob{name='Test_openjdk17_hs_extended.openjdk_x86-64_mac_testList_4'}
[2024-09-04T22:06:29.895Z] GeneratedJob{name='Test_openjdk17_hs_extended.openjdk_x86-64_mac_testList_5'}
[2024-09-04T22:06:29.964Z] Existing items:
[2024-09-04T22:06:29.965Z] GeneratedJob{name='Test_openjdk17_hs_extended.openjdk_x86-64_mac_testList_1'}
[2024-09-04T22:06:29.965Z] GeneratedJob{name='Test_openjdk17_hs_extended.openjdk_x86-64_mac_testList_2'}
[2024-09-04T22:06:29.965Z] Unreferenced items:
[2024-09-04T22:06:29.965Z] GeneratedJob{name='Test_openjdk17_hs_extended.openjdk_x86-64_mac_rerun'}
[2024-09-04T22:06:29.965Z] GeneratedJob{name='Test_openjdk17_hs_extended.openjdk_x86-64_mac_testList_0'}
[2024-09-04T22:06:29.965Z] GeneratedJob{name='Test_openjdk17_hs_extended.openjdk_x86-64_mac_testList_3'}
[2024-09-04T22:06:29.965Z] GeneratedJob{name='Test_openjdk17_hs_extended.openjdk_x86-64_mac_testList_4'}
[2024-09-04T22:06:29.965Z] GeneratedJob{name='Test_openjdk17_hs_extended.openjdk_x86-64_mac_testList_5'}
[2024-09-04T22:06:30.072Z] Existing items:
[2024-09-04T22:06:30.072Z] GeneratedJob{name='Test_openjdk17_hs_extended.openjdk_x86-64_mac_testList_1'}
[2024-09-04T22:06:30.072Z] GeneratedJob{name='Test_openjdk17_hs_extended.openjdk_x86-64_mac_testList_2'}
[2024-09-04T22:06:30.072Z] GeneratedJob{name='Test_openjdk17_hs_extended.openjdk_x86-64_mac_testList_3'}
[2024-09-04T22:06:30.072Z] Unreferenced items:
[2024-09-04T22:06:30.072Z] GeneratedJob{name='Test_openjdk17_hs_extended.openjdk_x86-64_mac_rerun'}
[2024-09-04T22:06:30.072Z] GeneratedJob{name='Test_openjdk17_hs_extended.openjdk_x86-64_mac_testList_0'}
[2024-09-04T22:06:30.072Z] GeneratedJob{name='Test_openjdk17_hs_extended.openjdk_x86-64_mac_testList_4'}
[2024-09-04T22:06:30.072Z] GeneratedJob{name='Test_openjdk17_hs_extended.openjdk_x86-64_mac_testList_5'}
[2024-09-04T22:06:30.081Z] Existing items:
[2024-09-04T22:06:30.081Z] GeneratedJob{name='Test_openjdk17_hs_extended.openjdk_x86-64_mac_testList_0'}
[2024-09-04T22:06:30.081Z] GeneratedJob{name='Test_openjdk17_hs_extended.openjdk_x86-64_mac_testList_1'}
[2024-09-04T22:06:30.081Z] GeneratedJob{name='Test_openjdk17_hs_extended.openjdk_x86-64_mac_testList_2'}
[2024-09-04T22:06:30.081Z] GeneratedJob{name='Test_openjdk17_hs_extended.openjdk_x86-64_mac_testList_3'}
[2024-09-04T22:06:30.081Z] Unreferenced items:
[2024-09-04T22:06:30.081Z] GeneratedJob{name='Test_openjdk17_hs_extended.openjdk_x86-64_mac_rerun'}
[2024-09-04T22:06:30.081Z] GeneratedJob{name='Test_openjdk17_hs_extended.openjdk_x86-64_mac_testList_4'}
[2024-09-04T22:06:30.081Z] GeneratedJob{name='Test_openjdk17_hs_extended.openjdk_x86-64_mac_testList_5'}
[Pipeline] }
[Pipeline] }
[Pipeline] }
[Pipeline] }
[Pipeline] // parallel
[Pipeline] }
[Pipeline] // stage
[Pipeline] echo
[2024-09-04T22:06:36.943Z] PROCESSCATCH: Terminating any hung/left over test processes:
[Pipeline] sh
[2024-09-04T22:06:38.562Z] + aqa-tests/terminateTestProcesses.sh jenkins
[2024-09-04T22:06:38.562Z] Mac type machine.. do not terminate any remaining processes as Orka mac VMs are not process isolated, see: https://github.com/adoptium/aqa-tests/issues/4964
[Pipeline] cleanWs
[2024-09-04T22:06:39.256Z] [WS-CLEANUP] Deleting project workspace...
[2024-09-04T22:06:39.257Z] [WS-CLEANUP] Deferred wipeout is disabled by the job configuration...
[2024-09-04T22:06:40.234Z] [WS-CLEANUP] done
[Pipeline] sh
[2024-09-04T22:06:41.853Z] + find /cores -name '*core*' -print -exec rm -f '{}' ';'
[2024-09-04T22:06:41.853Z] /cores
[Pipeline] }
[Pipeline] // timeout
[Pipeline] }
[Pipeline] // node
[Pipeline] }
[Pipeline] // stage
[Pipeline] echo
[2024-09-04T22:06:42.363Z] SETUP_LABEL: ci.role.test
[Pipeline] stage
[Pipeline] { (Parallel Tests)
[Pipeline] parallel
[Pipeline] { (Branch: testList_0)
[Pipeline] { (Branch: testList_1)
[Pipeline] { (Branch: testList_2)
[Pipeline] { (Branch: testList_3)
[Pipeline] build
[2024-09-04T22:06:42.407Z] Scheduling project: Test_openjdk17_hs_extended.openjdk_x86-64_mac_testList_0
[Pipeline] build
[2024-09-04T22:06:42.413Z] Scheduling project: Test_openjdk17_hs_extended.openjdk_x86-64_mac_testList_1
[Pipeline] build
[2024-09-04T22:06:42.453Z] Scheduling project: Test_openjdk17_hs_extended.openjdk_x86-64_mac_testList_2
[Pipeline] build
[2024-09-04T22:06:42.486Z] Scheduling project: Test_openjdk17_hs_extended.openjdk_x86-64_mac_testList_3
[2024-09-04T22:06:48.147Z] Starting building: Test_openjdk17_hs_extended.openjdk_x86-64_mac_testList_3 #9
[2024-09-04T22:06:48.155Z] Starting building: Test_openjdk17_hs_extended.openjdk_x86-64_mac_testList_2 #20
[2024-09-04T22:06:48.161Z] Starting building: Test_openjdk17_hs_extended.openjdk_x86-64_mac_testList_1 #24
[2024-09-04T22:06:48.166Z] Starting building: Test_openjdk17_hs_extended.openjdk_x86-64_mac_testList_0 #26
[2024-09-05T00:56:55.676Z] Build Test_openjdk17_hs_extended.openjdk_x86-64_mac_testList_3 #9 completed: SUCCESS
[Pipeline] }
[2024-09-05T01:31:34.504Z] Build Test_openjdk17_hs_extended.openjdk_x86-64_mac_testList_2 #20 completed: UNSTABLE
[Pipeline] }
[2024-09-05T02:44:39.272Z] Build Test_openjdk17_hs_extended.openjdk_x86-64_mac_testList_0 #26 completed: SUCCESS
[Pipeline] }
[2024-09-05T03:05:19.587Z] Build Test_openjdk17_hs_extended.openjdk_x86-64_mac_testList_1 #24 completed: SUCCESS
[Pipeline] }
[Pipeline] // parallel
[Pipeline] node
[2024-09-05T03:05:19.674Z] Running on test-docker-fedora39-armv8l-1 in /home/jenkins/workspace/Test_openjdk17_hs_extended.openjdk_x86-64_mac
[Pipeline] {
[Pipeline] cleanWs
[2024-09-05T03:05:19.957Z] [WS-CLEANUP] Deleting project workspace...
[2024-09-05T03:05:19.957Z] [WS-CLEANUP] Deferred wipeout is disabled by the job configuration...
[2024-09-05T03:05:20.085Z] [WS-CLEANUP] done
[Pipeline] echo
[2024-09-05T03:05:20.092Z] Test_openjdk17_hs_extended.openjdk_x86-64_mac_testList_3 #9 completed with status SUCCESS
[Pipeline] timeout
[2024-09-05T03:05:20.093Z] Timeout set to expire in 1 hr 0 min
[Pipeline] {
[Pipeline] copyArtifacts
[2024-09-05T03:05:21.030Z] Copied 1 artifact from "Test_openjdk17_hs_extended.openjdk_x86-64_mac_testList_3" build number 9
[Pipeline] }
[Pipeline] // timeout
[Pipeline] step
[2024-09-05T03:05:21.204Z] TAP Reports Processing: START
[2024-09-05T03:05:21.205Z] Looking for TAP results report in workspace using pattern: Test_openjdk17_hs_extended.openjdk_x86-64_mac_testList_3/9/**/*.tap
[2024-09-05T03:05:21.332Z] Saving reports...
[2024-09-05T03:05:21.463Z] Processing '/home/jenkins/.jenkins/jobs/Test_openjdk17_hs_extended.openjdk_x86-64_mac/builds/178/tap-master-files/Test_openjdk17_hs_extended.openjdk_x86-64_mac_testList_3/9/aqa-tests/TKG/output_17254906476748/Test_openjdk17_hs_extended.openjdk_x86-64_mac_testList_3.tap'
[2024-09-05T03:05:21.463Z] Parsing TAP test result [/home/jenkins/.jenkins/jobs/Test_openjdk17_hs_extended.openjdk_x86-64_mac/builds/178/tap-master-files/Test_openjdk17_hs_extended.openjdk_x86-64_mac_testList_3/9/aqa-tests/TKG/output_17254906476748/Test_openjdk17_hs_extended.openjdk_x86-64_mac_testList_3.tap].
[2024-09-05T03:05:21.472Z] TAP Reports Processing: FINISH
[Pipeline] echo
[2024-09-05T03:05:21.478Z] Saving Test_openjdk17_hs_extended.openjdk_x86-64_mac_testList_3/9/**/*.tap file on jenkins.
[Pipeline] archiveArtifacts
[2024-09-05T03:05:21.609Z] Archiving artifacts
[2024-09-05T03:05:21.869Z] Recording fingerprints
[Pipeline] echo
[2024-09-05T03:05:22.013Z] Test_openjdk17_hs_extended.openjdk_x86-64_mac_testList_2 #20 completed with status UNSTABLE
[Pipeline] timeout
[2024-09-05T03:05:22.014Z] Timeout set to expire in 1 hr 0 min
[Pipeline] {
[Pipeline] copyArtifacts
[2024-09-05T03:05:22.819Z] Copied 1 artifact from "Test_openjdk17_hs_extended.openjdk_x86-64_mac_testList_2" build number 20
[Pipeline] }
[Pipeline] // timeout
[Pipeline] step
[2024-09-05T03:05:23.013Z] TAP Reports Processing: START
[2024-09-05T03:05:23.014Z] Looking for TAP results report in workspace using pattern: Test_openjdk17_hs_extended.openjdk_x86-64_mac_testList_2/20/**/*.tap
[2024-09-05T03:05:23.141Z] Saving reports...
[2024-09-05T03:05:23.270Z] Processing '/home/jenkins/.jenkins/jobs/Test_openjdk17_hs_extended.openjdk_x86-64_mac/builds/178/tap-master-files/Test_openjdk17_hs_extended.openjdk_x86-64_mac_testList_2/20/aqa-tests/TKG/output_17254936807239/Test_openjdk17_hs_extended.openjdk_x86-64_mac_testList_2.tap'
[2024-09-05T03:05:23.270Z] Parsing TAP test result [/home/jenkins/.jenkins/jobs/Test_openjdk17_hs_extended.openjdk_x86-64_mac/builds/178/tap-master-files/Test_openjdk17_hs_extended.openjdk_x86-64_mac_testList_2/20/aqa-tests/TKG/output_17254936807239/Test_openjdk17_hs_extended.openjdk_x86-64_mac_testList_2.tap].
[2024-09-05T03:05:23.275Z] There are failed test cases. Marking build as UNSTABLE
[2024-09-05T03:05:23.296Z] TAP Reports Processing: FINISH
[Pipeline] echo
[2024-09-05T03:05:23.308Z] Saving Test_openjdk17_hs_extended.openjdk_x86-64_mac_testList_2/20/**/*.tap file on jenkins.
[Pipeline] archiveArtifacts
[2024-09-05T03:05:23.442Z] Archiving artifacts
[2024-09-05T03:05:23.699Z] Recording fingerprints
[Pipeline] echo
[2024-09-05T03:05:23.845Z] Test_openjdk17_hs_extended.openjdk_x86-64_mac_testList_1 #24 completed with status SUCCESS
[Pipeline] timeout
[2024-09-05T03:05:23.847Z] Timeout set to expire in 1 hr 0 min
[Pipeline] {
[Pipeline] copyArtifacts
[2024-09-05T03:05:24.640Z] Copied 1 artifact from "Test_openjdk17_hs_extended.openjdk_x86-64_mac_testList_1" build number 24
[Pipeline] }
[Pipeline] // timeout
[Pipeline] step
[2024-09-05T03:05:24.835Z] TAP Reports Processing: START
[2024-09-05T03:05:24.856Z] Looking for TAP results report in workspace using pattern: Test_openjdk17_hs_extended.openjdk_x86-64_mac_testList_1/24/**/*.tap
[2024-09-05T03:05:24.983Z] Saving reports...
[2024-09-05T03:05:25.111Z] Processing '/home/jenkins/.jenkins/jobs/Test_openjdk17_hs_extended.openjdk_x86-64_mac/builds/178/tap-master-files/Test_openjdk17_hs_extended.openjdk_x86-64_mac_testList_1/24/aqa-tests/TKG/output_17254945375043/Test_openjdk17_hs_extended.openjdk_x86-64_mac_testList_1.tap'
[2024-09-05T03:05:25.111Z] Parsing TAP test result [/home/jenkins/.jenkins/jobs/Test_openjdk17_hs_extended.openjdk_x86-64_mac/builds/178/tap-master-files/Test_openjdk17_hs_extended.openjdk_x86-64_mac_testList_1/24/aqa-tests/TKG/output_17254945375043/Test_openjdk17_hs_extended.openjdk_x86-64_mac_testList_1.tap].
[2024-09-05T03:05:25.130Z] TAP Reports Processing: FINISH
[Pipeline] echo
[2024-09-05T03:05:25.137Z] Saving Test_openjdk17_hs_extended.openjdk_x86-64_mac_testList_1/24/**/*.tap file on jenkins.
[Pipeline] archiveArtifacts
[2024-09-05T03:05:25.269Z] Archiving artifacts
[2024-09-05T03:05:25.528Z] Recording fingerprints
[Pipeline] echo
[2024-09-05T03:05:25.675Z] Test_openjdk17_hs_extended.openjdk_x86-64_mac_testList_0 #26 completed with status SUCCESS
[Pipeline] timeout
[2024-09-05T03:05:25.677Z] Timeout set to expire in 1 hr 0 min
[Pipeline] {
[Pipeline] copyArtifacts
[2024-09-05T03:05:26.482Z] Copied 1 artifact from "Test_openjdk17_hs_extended.openjdk_x86-64_mac_testList_0" build number 26
[Pipeline] }
[Pipeline] // timeout
[Pipeline] step
[2024-09-05T03:05:26.668Z] TAP Reports Processing: START
[2024-09-05T03:05:26.669Z] Looking for TAP results report in workspace using pattern: Test_openjdk17_hs_extended.openjdk_x86-64_mac_testList_0/26/**/*.tap
[2024-09-05T03:05:26.797Z] Saving reports...
[2024-09-05T03:05:26.927Z] Processing '/home/jenkins/.jenkins/jobs/Test_openjdk17_hs_extended.openjdk_x86-64_mac/builds/178/tap-master-files/Test_openjdk17_hs_extended.openjdk_x86-64_mac_testList_0/26/aqa-tests/TKG/output_17254913803297/Test_openjdk17_hs_extended.openjdk_x86-64_mac_testList_0.tap'
[2024-09-05T03:05:26.927Z] Parsing TAP test result [/home/jenkins/.jenkins/jobs/Test_openjdk17_hs_extended.openjdk_x86-64_mac/builds/178/tap-master-files/Test_openjdk17_hs_extended.openjdk_x86-64_mac_testList_0/26/aqa-tests/TKG/output_17254913803297/Test_openjdk17_hs_extended.openjdk_x86-64_mac_testList_0.tap].
[2024-09-05T03:05:26.952Z] TAP Reports Processing: FINISH
[Pipeline] echo
[2024-09-05T03:05:26.960Z] Saving Test_openjdk17_hs_extended.openjdk_x86-64_mac_testList_0/26/**/*.tap file on jenkins.
[Pipeline] archiveArtifacts
[2024-09-05T03:05:27.094Z] Archiving artifacts
[2024-09-05T03:05:27.350Z] Recording fingerprints
[Pipeline] findFiles
[Pipeline] readFile
[Pipeline] findFiles
[Pipeline] echo
[2024-09-05T03:05:29.859Z] Tap file found: Test_openjdk17_hs_extended.openjdk_x86-64_mac_testList_3/9/aqa-tests/TKG/output_17254906476748/Test_openjdk17_hs_extended.openjdk_x86-64_mac_testList_3.tap...
[Pipeline] readFile
[Pipeline] findFiles
[Pipeline] echo
[2024-09-05T03:05:30.573Z] Tap file found: Test_openjdk17_hs_extended.openjdk_x86-64_mac_testList_2/20/aqa-tests/TKG/output_17254936807239/Test_openjdk17_hs_extended.openjdk_x86-64_mac_testList_2.tap...
[Pipeline] readFile
[Pipeline] findFiles
[Pipeline] echo
[2024-09-05T03:05:31.254Z] Tap file found: Test_openjdk17_hs_extended.openjdk_x86-64_mac_testList_1/24/aqa-tests/TKG/output_17254945375043/Test_openjdk17_hs_extended.openjdk_x86-64_mac_testList_1.tap...
[Pipeline] readFile
[Pipeline] findFiles
[Pipeline] echo
[2024-09-05T03:05:31.911Z] Tap file found: Test_openjdk17_hs_extended.openjdk_x86-64_mac_testList_0/26/aqa-tests/TKG/output_17254913803297/Test_openjdk17_hs_extended.openjdk_x86-64_mac_testList_0.tap...
[Pipeline] readFile
[Pipeline] echo
[2024-09-05T03:05:32.102Z] Rerun in Grinder with failed test targets: https://ci.adoptium.net/job/Grinder/parambuild/?SDK_RESOURCE=upstream&TARGET=testList+TESTLIST=jdk_nio_0,jdk_nio_1&BASE_DOCKER_REGISTRY_CREDENTIAL_ID=&TEST_FLAG=&UPSTREAM_TEST_JOB_NAME=&DOCKER_REQUIRED=false&ACTIVE_NODE_TIMEOUT=5&VENDOR_TEST_DIRS=&EXTRA_DOCKER_ARGS=&TKG_OWNER_BRANCH=adoptium%3Amaster&OPENJ9_SYSTEMTEST_OWNER_BRANCH=eclipse%3Amaster&PLATFORM=x86-64_mac&GENERATE_JOBS=true&KEEP_REPORTDIR=true&PERSONAL_BUILD=false&DOCKER_REGISTRY_DIR=&RERUN_ITERATIONS=1&ADOPTOPENJDK_REPO=https%3A%2F%2Fgithub.com%2Fadoptium%2Faqa-tests.git&SETUP_JCK_RUN=false&DOCKER_REGISTRY_URL_CREDENTIAL_ID=&LABEL=&EXTRA_OPTIONS=&CUSTOMIZED_SDK_URL=&BUILD_IDENTIFIER=&JENKINS_KEY=&ADOPTOPENJDK_BRANCH=master&LIGHT_WEIGHT_CHECKOUT=false&USE_JRE=false&ARTIFACTORY_SERVER=&KEEP_WORKSPACE=false&USER_CREDENTIALS_ID=&JDK_VERSION=17&DOCKER_REGISTRY_URL=&ITERATIONS=1&VENDOR_TEST_REPOS=&JDK_REPO=https%3A%2F%2Fgithub.com%2Fadoptium%2Fjdk17u&JCK_GIT_BRANCH=master&OPENJ9_BRANCH=master&OPENJ9_SHA=&JCK_GIT_REPO=&VENDOR_TEST_BRANCHES=&UPSTREAM_JOB_NAME=build-scripts%2Fjobs%2Fjdk17u%2Fjdk17u-mac-x64-temurin&OPENJ9_REPO=https%3A%2F%2Fgithub.com%2Feclipse-openj9%2Fopenj9.git&CLOUD_PROVIDER=&CUSTOM_TARGET=&VENDOR_TEST_SHAS=&JDK_BRANCH=jdk-17.0.13%2B6_adopt&LABEL_ADDITION=&ARTIFACTORY_REPO=&ARTIFACTORY_ROOT_DIR=&UPSTREAM_TEST_JOB_NUMBER=&DOCKERIMAGE_TAG=&TEST_TIME=120&JDK_IMPL=hotspot&SSH_AGENT_CREDENTIAL=&AUTO_DETECT=true&SLACK_CHANNEL=&DYNAMIC_COMPILE=false&RELATED_NODES=&ADOPTOPENJDK_SYSTEMTEST_OWNER_BRANCH=adoptium%3Amaster&APPLICATION_OPTIONS=&CUSTOMIZED_SDK_URL_CREDENTIAL_ID=eclipse_temurin_bot_email_and_token&ARCHIVE_TEST_RESULTS=false&NUM_MACHINES=&OPENJDK_SHA=&TRSS_URL=&USE_TESTENV_PROPERTIES=false&BUILD_LIST=openjdk&ADDITIONAL_ARTIFACTS_REQUIRED=&UPSTREAM_JOB_NUMBER=550&STF_OWNER_BRANCH=adoptium%3Amaster&TIME_LIMIT=25&JVM_OPTIONS=&PARALLEL=Dynamic
[Pipeline] echo
[2024-09-05T03:05:32.223Z] Rerun failed jdk test cases in Grinder with jdk_custom target: https://ci.adoptium.net/job/Grinder/parambuild/?SDK_RESOURCE=upstream&TARGET=jdk_custom&BASE_DOCKER_REGISTRY_CREDENTIAL_ID=&TEST_FLAG=&UPSTREAM_TEST_JOB_NAME=&DOCKER_REQUIRED=false&ACTIVE_NODE_TIMEOUT=5&VENDOR_TEST_DIRS=&EXTRA_DOCKER_ARGS=&TKG_OWNER_BRANCH=adoptium%3Amaster&OPENJ9_SYSTEMTEST_OWNER_BRANCH=eclipse%3Amaster&PLATFORM=x86-64_mac&GENERATE_JOBS=true&KEEP_REPORTDIR=true&PERSONAL_BUILD=false&DOCKER_REGISTRY_DIR=&RERUN_ITERATIONS=1&ADOPTOPENJDK_REPO=https%3A%2F%2Fgithub.com%2Fadoptium%2Faqa-tests.git&SETUP_JCK_RUN=false&DOCKER_REGISTRY_URL_CREDENTIAL_ID=&LABEL=&EXTRA_OPTIONS=&CUSTOMIZED_SDK_URL=&BUILD_IDENTIFIER=&JENKINS_KEY=&ADOPTOPENJDK_BRANCH=master&LIGHT_WEIGHT_CHECKOUT=false&USE_JRE=false&ARTIFACTORY_SERVER=&KEEP_WORKSPACE=false&USER_CREDENTIALS_ID=&JDK_VERSION=17&DOCKER_REGISTRY_URL=&ITERATIONS=1&VENDOR_TEST_REPOS=&JDK_REPO=https%3A%2F%2Fgithub.com%2Fadoptium%2Fjdk17u&JCK_GIT_BRANCH=master&OPENJ9_BRANCH=master&OPENJ9_SHA=&JCK_GIT_REPO=&VENDOR_TEST_BRANCHES=&UPSTREAM_JOB_NAME=build-scripts%2Fjobs%2Fjdk17u%2Fjdk17u-mac-x64-temurin&OPENJ9_REPO=https%3A%2F%2Fgithub.com%2Feclipse-openj9%2Fopenj9.git&CLOUD_PROVIDER=&CUSTOM_TARGET=java%2Fnio%2Fchannels%2FDatagramChannel%2FDisconnect.java+java%2Fnio%2Fchannels%2FDatagramChannel%2FDisconnect.java&VENDOR_TEST_SHAS=&JDK_BRANCH=jdk-17.0.13%2B6_adopt&LABEL_ADDITION=&ARTIFACTORY_REPO=&ARTIFACTORY_ROOT_DIR=&UPSTREAM_TEST_JOB_NUMBER=&DOCKERIMAGE_TAG=&TEST_TIME=120&JDK_IMPL=hotspot&SSH_AGENT_CREDENTIAL=&AUTO_DETECT=true&SLACK_CHANNEL=&DYNAMIC_COMPILE=false&RELATED_NODES=&ADOPTOPENJDK_SYSTEMTEST_OWNER_BRANCH=adoptium%3Amaster&APPLICATION_OPTIONS=&CUSTOMIZED_SDK_URL_CREDENTIAL_ID=eclipse_temurin_bot_email_and_token&ARCHIVE_TEST_RESULTS=false&NUM_MACHINES=&OPENJDK_SHA=&TRSS_URL=&USE_TESTENV_PROPERTIES=false&BUILD_LIST=openjdk&ADDITIONAL_ARTIFACTS_REQUIRED=&UPSTREAM_JOB_NUMBER=550&STF_OWNER_BRANCH=adoptium%3Amaster&TIME_LIMIT=25&JVM_OPTIONS=&PARALLEL=Dynamic
[Pipeline] cleanWs
[2024-09-05T03:05:32.577Z] [WS-CLEANUP] Deleting project workspace...
[2024-09-05T03:05:32.577Z] [WS-CLEANUP] Deferred wipeout is disabled by the job configuration...
[2024-09-05T03:05:32.711Z] [WS-CLEANUP] done
[Pipeline] }
[Pipeline] // node
[Pipeline] }
[Pipeline] // stage
[Pipeline] stage
[Pipeline] { (Rerun)
[Pipeline] echo
[2024-09-05T03:05:32.863Z] allocate a node for generating rerun job ...
[Pipeline] node
[2024-09-05T03:05:32.913Z] Running on test-docker-ubuntu2004-armv8l-2 in /home/jenkins/workspace/Test_openjdk17_hs_extended.openjdk_x86-64_mac
[Pipeline] {
[Pipeline] parallel
[Pipeline] { (Branch: Test_openjdk17_hs_extended.openjdk_x86-64_mac_rerun)
[Pipeline] echo
[2024-09-05T03:05:32.968Z] GENERATE_JOBS is set to true, set test job Test_openjdk17_hs_extended.openjdk_x86-64_mac_rerun params for generating the job
[Pipeline] fileExists
[Pipeline] sh
[2024-09-05T03:05:34.665Z] + curl -Os https://raw.githubusercontent.com/adoptium/aqa-tests/master/buildenv/jenkins/testJobTemplate
[Pipeline] jobDsl
[2024-09-05T03:05:35.703Z] Processing DSL script testJobTemplate
[2024-09-05T03:08:55.209Z] LEVELS: [extended]
[2024-09-05T03:08:55.209Z] JDK_VERSIONS: [8]
[2024-09-05T03:08:55.209Z] GROUPS: [openjdk]
[2024-09-05T03:08:55.209Z] ARCH_OS_LIST: [x86-64_mac]
[2024-09-05T03:08:55.371Z] Existing items:
[2024-09-05T03:08:55.371Z] GeneratedJob{name='Test_openjdk17_hs_extended.openjdk_x86-64_mac_rerun'}
[2024-09-05T03:08:55.371Z] GeneratedJob{name='Test_openjdk17_hs_extended.openjdk_x86-64_mac_testList_0'}
[2024-09-05T03:08:55.371Z] GeneratedJob{name='Test_openjdk17_hs_extended.openjdk_x86-64_mac_testList_1'}
[2024-09-05T03:08:55.371Z] GeneratedJob{name='Test_openjdk17_hs_extended.openjdk_x86-64_mac_testList_2'}
[2024-09-05T03:08:55.371Z] GeneratedJob{name='Test_openjdk17_hs_extended.openjdk_x86-64_mac_testList_3'}
[2024-09-05T03:08:55.371Z] Unreferenced items:
[2024-09-05T03:08:55.371Z] GeneratedJob{name='Test_openjdk17_hs_extended.openjdk_x86-64_mac_testList_4'}
[2024-09-05T03:08:55.371Z] GeneratedJob{name='Test_openjdk17_hs_extended.openjdk_x86-64_mac_testList_5'}
[Pipeline] }
[Pipeline] // parallel
[Pipeline] }
[Pipeline] // node
[Pipeline] build
[2024-09-05T03:08:57.363Z] Scheduling project: Test_openjdk17_hs_extended.openjdk_x86-64_mac_rerun
[2024-09-05T03:09:03.529Z] Starting building: Test_openjdk17_hs_extended.openjdk_x86-64_mac_rerun #11
[2024-09-05T03:12:05.773Z] Build Test_openjdk17_hs_extended.openjdk_x86-64_mac_rerun #11 completed: UNSTABLE
[Pipeline] echo
[2024-09-05T03:12:05.775Z] Test_openjdk17_hs_extended.openjdk_x86-64_mac_rerun #11 completed with status UNSTABLE
[Pipeline] node
[2024-09-05T03:12:05.855Z] Running on test-docker-ubuntu2204-armv8-1 in /home/jenkins/workspace/Test_openjdk17_hs_extended.openjdk_x86-64_mac
[Pipeline] {
[Pipeline] timeout
[2024-09-05T03:12:05.875Z] Timeout set to expire in 1 hr 0 min
[Pipeline] {
[Pipeline] copyArtifacts
[2024-09-05T03:12:06.776Z] Copied 1 artifact from "Test_openjdk17_hs_extended.openjdk_x86-64_mac_rerun" build number 11
[Pipeline] step
[2024-09-05T03:12:06.918Z] TAP Reports Processing: START
[2024-09-05T03:12:06.919Z] Looking for TAP results report in workspace using pattern: Test_openjdk17_hs_extended.openjdk_x86-64_mac_rerun/11/**/*.tap
[2024-09-05T03:12:07.044Z] Saving reports...
[2024-09-05T03:12:07.170Z] Processing '/home/jenkins/.jenkins/jobs/Test_openjdk17_hs_extended.openjdk_x86-64_mac/builds/178/tap-master-files/Test_openjdk17_hs_extended.openjdk_x86-64_mac_rerun/11/aqa-tests/TKG/output_17255058723380/Test_openjdk17_hs_extended.openjdk_x86-64_mac_rerun.tap'
[2024-09-05T03:12:07.170Z] Parsing TAP test result [/home/jenkins/.jenkins/jobs/Test_openjdk17_hs_extended.openjdk_x86-64_mac/builds/178/tap-master-files/Test_openjdk17_hs_extended.openjdk_x86-64_mac_rerun/11/aqa-tests/TKG/output_17255058723380/Test_openjdk17_hs_extended.openjdk_x86-64_mac_rerun.tap].
[2024-09-05T03:12:07.172Z] There are failed test cases. Marking build as UNSTABLE
[2024-09-05T03:12:07.195Z] TAP Reports Processing: FINISH
[Pipeline] echo
[2024-09-05T03:12:07.207Z] Saving Test_openjdk17_hs_extended.openjdk_x86-64_mac_rerun/11/**/*.tap file on jenkins.
[Pipeline] archiveArtifacts
[2024-09-05T03:12:07.341Z] Archiving artifacts
[2024-09-05T03:12:07.594Z] Recording fingerprints
[Pipeline] }
[Pipeline] // timeout
[Pipeline] }
[Pipeline] // node
[Pipeline] }
[Pipeline] // stage
[Pipeline] }
[Pipeline] // timestamps
[Pipeline] End of Pipeline
/home/jenkins/.jenkins/workspace/Test_openjdk17_hs_extended.openjdk_x86-64_mac@tmp/jfrog/178/.jfrog deleted
Finished: UNSTABLE