testXXArgumentTesting_0
[2023-04-18T21:57:21.082Z] Running test testXXArgumentTesting_0 ...
[2023-04-18T21:57:21.082Z] ===============================================
[2023-04-18T21:57:21.082Z] testXXArgumentTesting_0 Start Time: Tue Apr 18 21:57:20 2023 Epoch Time (ms): 1681855040756
[2023-04-18T21:57:21.082Z] variation: Mode150
[2023-04-18T21:57:21.082Z] JVM_OPTIONS: -XX:+UseCompressedOops
[2023-04-18T21:57:21.082Z] { \
[2023-04-18T21:57:21.082Z] echo ""; echo "TEST SETUP:"; \
[2023-04-18T21:57:21.082Z] echo "Nothing to be done for setup."; \
[2023-04-18T21:57:21.082Z] mkdir -p "/home/jenkins/workspace/Test_openjdk17_hs_sanity.functional_x86-64_linux/aqa-tests/TKG/../TKG/output_16818550359586/testXXArgumentTesting_0"; \
[2023-04-18T21:57:21.082Z] cd "/home/jenkins/workspace/Test_openjdk17_hs_sanity.functional_x86-64_linux/aqa-tests/TKG/../TKG/output_16818550359586/testXXArgumentTesting_0"; \
[2023-04-18T21:57:21.082Z] echo ""; echo "TESTING:"; \
[2023-04-18T21:57:21.082Z] "/home/jenkins/workspace/Test_openjdk17_hs_sanity.functional_x86-64_linux/openjdkbinary/j2sdk-image/jdk-17.0.7+7/bin/..//bin/java" -DEXE='"/home/jenkins/workspace/Test_openjdk17_hs_sanity.functional_x86-64_linux/openjdkbinary/j2sdk-image/jdk-17.0.7+7/bin/..//bin/java" -XX:+UseCompressedOops ' -jar "/home/jenkins/workspace/Test_openjdk17_hs_sanity.functional_x86-64_linux/aqa-tests/TKG/../../jvmtest/functional/cmdline_options_tester/cmdlinetester.jar" \
[2023-04-18T21:57:21.082Z] -config "/home/jenkins/workspace/Test_openjdk17_hs_sanity.functional_x86-64_linux/aqa-tests/TKG/../../jvmtest/functional/cmdLineTests/xxargtest/XXArgumentTesting.xml"; \
[2023-04-18T21:57:21.082Z] if [ $? -eq 0 ]; then echo "-----------------------------------"; echo "testXXArgumentTesting_0""_PASSED"; echo "-----------------------------------"; cd /home/jenkins/workspace/Test_openjdk17_hs_sanity.functional_x86-64_linux/aqa-tests/TKG/..; rm -f -r "/home/jenkins/workspace/Test_openjdk17_hs_sanity.functional_x86-64_linux/aqa-tests/TKG/../TKG/output_16818550359586/testXXArgumentTesting_0"; else echo "-----------------------------------"; echo "testXXArgumentTesting_0""_FAILED"; echo "-----------------------------------"; fi; \
[2023-04-18T21:57:21.082Z] echo ""; echo "TEST TEARDOWN:"; \
[2023-04-18T21:57:21.082Z] echo "Nothing to be done for teardown."; \
[2023-04-18T21:57:21.082Z] } 2>&1 | tee -a "/home/jenkins/workspace/Test_openjdk17_hs_sanity.functional_x86-64_linux/aqa-tests/TKG/../TKG/output_16818550359586/TestTargetResult";
[2023-04-18T21:57:21.082Z]
[2023-04-18T21:57:21.082Z] TEST SETUP:
[2023-04-18T21:57:21.082Z] Nothing to be done for setup.
[2023-04-18T21:57:21.082Z]
[2023-04-18T21:57:21.082Z] TESTING:
[2023-04-18T21:57:21.082Z] *** Starting test suite: XXArgumentTesting.xml ***
[2023-04-18T21:57:21.082Z] Testing: Ensure -XXnosuballoc32bitmem is recognized on all platforms
[2023-04-18T21:57:21.082Z] Test start time: 2023/04/18 21:57:20 Coordinated Universal Time
[2023-04-18T21:57:21.082Z] Running command: "/home/jenkins/workspace/Test_openjdk17_hs_sanity.functional_x86-64_linux/openjdkbinary/j2sdk-image/jdk-17.0.7+7/bin/..//bin/java" -XX:+UseCompressedOops -Xcompressedrefs -XXnosuballoc32bitmem -version
[2023-04-18T21:57:21.082Z] Time spent starting: 18 milliseconds
[2023-04-18T21:57:21.082Z] Time spent executing: 25 milliseconds
[2023-04-18T21:57:21.082Z] Test result: FAILED
[2023-04-18T21:57:21.082Z] Output from test:
[2023-04-18T21:57:21.082Z] [ERR] Unrecognized option: -Xcompressedrefs
[2023-04-18T21:57:21.082Z] [ERR] Error: Could not create the Java Virtual Machine.
[2023-04-18T21:57:21.082Z] [ERR] Error: A fatal exception has occurred. Program will exit.
[2023-04-18T21:57:21.082Z] >> Success condition was not found: [Output match: (java|openjdk|semeru) version]
[2023-04-18T21:57:21.082Z] >> Failure condition was not found: [Output match: Command-line option unrecognised]
[2023-04-18T21:57:21.082Z] >> Failure condition was not found: [Output match: Unhandled Exception]
[2023-04-18T21:57:21.082Z] >> Failure condition was not found: [Output match: Exception:]
[2023-04-18T21:57:21.082Z] >> Failure condition was not found: [Output match: Processing dump event]
[2023-04-18T21:57:21.082Z]
[2023-04-18T21:57:21.082Z] Executing command: rm -f testjavacore.txt
[2023-04-18T21:57:21.082Z]
[2023-04-18T21:57:21.082Z] Testing: Generate a javacore without -XXnosuballoc32bitmem
[2023-04-18T21:57:21.082Z] Test start time: 2023/04/18 21:57:20 Coordinated Universal Time
[2023-04-18T21:57:21.082Z] Running command: "/home/jenkins/workspace/Test_openjdk17_hs_sanity.functional_x86-64_linux/openjdkbinary/j2sdk-image/jdk-17.0.7+7/bin/..//bin/java" -XX:+UseCompressedOops -Xcompressedrefs -Xdump:java:events=vmstop,file=testjavacore.txt -version
[2023-04-18T21:57:21.082Z] Time spent starting: 2 milliseconds
[2023-04-18T21:57:21.082Z] Time spent executing: 7 milliseconds
[2023-04-18T21:57:21.082Z] Test result: FAILED
[2023-04-18T21:57:21.082Z] Output from test:
[2023-04-18T21:57:21.082Z] [ERR] Unrecognized option: -Xcompressedrefs
[2023-04-18T21:57:21.082Z] [ERR] Error: Could not create the Java Virtual Machine.
[2023-04-18T21:57:21.082Z] [ERR] Error: A fatal exception has occurred. Program will exit.
[2023-04-18T21:57:21.082Z] >> Success condition was not found: [Output match: (java|openjdk|semeru) version]
[2023-04-18T21:57:21.082Z] >> Failure condition was not found: [Output match: Command-line option unrecognised]
[2023-04-18T21:57:21.082Z] >> Failure condition was not found: [Output match: Unhandled Exception]
[2023-04-18T21:57:21.082Z] >> Failure condition was not found: [Output match: Exception:]
[2023-04-18T21:57:21.082Z]
[2023-04-18T21:57:21.082Z] Testing: Verify that the sub allocator memory is listed in the javacore
[2023-04-18T21:57:21.082Z] Test start time: 2023/04/18 21:57:20 Coordinated Universal Time
[2023-04-18T21:57:21.082Z] Running command: cat testjavacore.txt
[2023-04-18T21:57:21.082Z] Time spent starting: 2 milliseconds
[2023-04-18T21:57:21.082Z] Time spent executing: 2 milliseconds
[2023-04-18T21:57:21.082Z] Test result: FAILED
[2023-04-18T21:57:21.082Z] Output from test:
[2023-04-18T21:57:21.082Z] [ERR] cat: testjavacore.txt: No such file or directory
[2023-04-18T21:57:21.082Z] >> Success condition was not found: [Output match: 32bit allocation regions]
[2023-04-18T21:57:21.082Z]
[2023-04-18T21:57:21.082Z] Executing command: rm -f testjavacore.txt
[2023-04-18T21:57:21.082Z]
[2023-04-18T21:57:21.082Z] Testing: Generate a javacore with -XXnosuballoc32bitmem
[2023-04-18T21:57:21.082Z] Test start time: 2023/04/18 21:57:20 Coordinated Universal Time
[2023-04-18T21:57:21.082Z] Running command: "/home/jenkins/workspace/Test_openjdk17_hs_sanity.functional_x86-64_linux/openjdkbinary/j2sdk-image/jdk-17.0.7+7/bin/..//bin/java" -XX:+UseCompressedOops -Xcompressedrefs -XXnosuballoc32bitmem -Xdump:java:events=vmstop,file=testjavacore.txt -version
[2023-04-18T21:57:21.082Z] Time spent starting: 1 milliseconds
[2023-04-18T21:57:21.082Z] Time spent executing: 6 milliseconds
[2023-04-18T21:57:21.082Z] Test result: FAILED
[2023-04-18T21:57:21.083Z] Output from test:
[2023-04-18T21:57:21.083Z] [ERR] Unrecognized option: -Xcompressedrefs
[2023-04-18T21:57:21.083Z] [ERR] Error: Could not create the Java Virtual Machine.
[2023-04-18T21:57:21.083Z] [ERR] Error: A fatal exception has occurred. Program will exit.
[2023-04-18T21:57:21.083Z] >> Success condition was not found: [Output match: (java|openjdk|semeru) version]
[2023-04-18T21:57:21.083Z] >> Failure condition was not found: [Output match: Command-line option unrecognised]
[2023-04-18T21:57:21.083Z] >> Failure condition was not found: [Output match: Unhandled Exception]
[2023-04-18T21:57:21.083Z] >> Failure condition was not found: [Output match: Exception:]
[2023-04-18T21:57:21.083Z]
[2023-04-18T21:57:21.083Z] Testing: Verify that the sub allocator memory is not listed in the javacore on z/OS. All other platforms should use the sub-allocator when -XXnosuballoc32bitmem is used.
[2023-04-18T21:57:21.083Z] Test start time: 2023/04/18 21:57:20 Coordinated Universal Time
[2023-04-18T21:57:21.083Z] Running command: cat testjavacore.txt
[2023-04-18T21:57:21.083Z] Time spent starting: 1 milliseconds
[2023-04-18T21:57:21.083Z] Time spent executing: 2 milliseconds
[2023-04-18T21:57:21.083Z] Test result: FAILED
[2023-04-18T21:57:21.083Z] Output from test:
[2023-04-18T21:57:21.083Z] [ERR] cat: testjavacore.txt: No such file or directory
[2023-04-18T21:57:21.083Z] >> Success condition was not found: [Output match: Javacore filename]
[2023-04-18T21:57:21.083Z]
[2023-04-18T21:57:21.083Z] Testing: Verify -XX:MaxHeapSize -XX:InitialHeapSize -XX:ThreadStackSize
[2023-04-18T21:57:21.083Z] Test start time: 2023/04/18 21:57:20 Coordinated Universal Time
[2023-04-18T21:57:21.083Z] Running command: "/home/jenkins/workspace/Test_openjdk17_hs_sanity.functional_x86-64_linux/openjdkbinary/j2sdk-image/jdk-17.0.7+7/bin/..//bin/java" -XX:+UseCompressedOops -XX:MaxHeapSize=234m -XX:InitialHeapSize=11m -verbose:sizes -version
[2023-04-18T21:57:21.083Z] Time spent starting: 1 milliseconds
[2023-04-18T21:57:21.083Z] Time spent executing: 33 milliseconds
[2023-04-18T21:57:21.083Z] Test result: FAILED
[2023-04-18T21:57:21.083Z] Output from test:
[2023-04-18T21:57:21.083Z] [ERR] openjdk version "17.0.7" 2023-04-18
[2023-04-18T21:57:21.083Z] [ERR] OpenJDK Runtime Environment Temurin-17.0.7+7 (build 17.0.7+7)
[2023-04-18T21:57:21.083Z] [ERR] OpenJDK 64-Bit Server VM Temurin-17.0.7+7 (build 17.0.7+7, mixed mode, sharing)
[2023-04-18T21:57:21.083Z] >> Success condition was not found: [Output match: OpenJ9]
[2023-04-18T21:57:21.083Z] >> Required condition was not found: [Output match: -Xmx234M]
[2023-04-18T21:57:21.083Z] >> Required condition was not found: [Output match: -Xms11M]
[2023-04-18T21:57:21.083Z]
[2023-04-18T21:57:21.083Z] Testing: Verify -XX:+PrintFlagsFinal
[2023-04-18T21:57:21.083Z] Test start time: 2023/04/18 21:57:20 Coordinated Universal Time
[2023-04-18T21:57:21.083Z] Running command: "/home/jenkins/workspace/Test_openjdk17_hs_sanity.functional_x86-64_linux/openjdkbinary/j2sdk-image/jdk-17.0.7+7/bin/..//bin/java" -XX:+UseCompressedOops -XX:+PrintFlagsFinal -version
[2023-04-18T21:57:21.083Z] Time spent starting: 1 milliseconds
[2023-04-18T21:57:21.083Z] Time spent executing: 52 milliseconds
[2023-04-18T21:57:21.083Z] Test result: PASSED
[2023-04-18T21:57:21.083Z]
[2023-04-18T21:57:21.083Z] Testing: Verify rightmost -XX:+PrintFlagsFinal overrides earlier -XX:-PrintFlagsFinal
[2023-04-18T21:57:21.083Z] Test start time: 2023/04/18 21:57:21 Coordinated Universal Time
[2023-04-18T21:57:21.083Z] Running command: "/home/jenkins/workspace/Test_openjdk17_hs_sanity.functional_x86-64_linux/openjdkbinary/j2sdk-image/jdk-17.0.7+7/bin/..//bin/java" -XX:+UseCompressedOops -XX:-PrintFlagsFinal -XX:+PrintFlagsFinal -version
[2023-04-18T21:57:21.083Z] Time spent starting: 1 milliseconds
[2023-04-18T21:57:21.426Z] Time spent executing: 63 milliseconds
[2023-04-18T21:57:21.426Z] Test result: PASSED
[2023-04-18T21:57:21.426Z]
[2023-04-18T21:57:21.426Z] Testing: Verify rightmost -XX:-PrintFlagsFinal overrides earlier -XX:+PrintFlagsFinal
[2023-04-18T21:57:21.426Z] Test start time: 2023/04/18 21:57:21 Coordinated Universal Time
[2023-04-18T21:57:21.426Z] Running command: "/home/jenkins/workspace/Test_openjdk17_hs_sanity.functional_x86-64_linux/openjdkbinary/j2sdk-image/jdk-17.0.7+7/bin/..//bin/java" -XX:+UseCompressedOops -XX:+PrintFlagsFinal -XX:-PrintFlagsFinal -version
[2023-04-18T21:57:21.426Z] Time spent starting: 3 milliseconds
[2023-04-18T21:57:21.426Z] Time spent executing: 35 milliseconds
[2023-04-18T21:57:21.426Z] Test result: PASSED
[2023-04-18T21:57:21.426Z]
[2023-04-18T21:57:21.426Z]
[2023-04-18T21:57:21.426Z] ---TEST RESULTS---
[2023-04-18T21:57:21.426Z] Number of PASSED tests: 3 out of 9
[2023-04-18T21:57:21.426Z] Number of FAILED tests: 6 out of 9
[2023-04-18T21:57:21.426Z]
[2023-04-18T21:57:21.426Z] ---SUMMARY OF FAILED TESTS---
[2023-04-18T21:57:21.426Z] Ensure -XXnosuballoc32bitmem is recognized on all platforms
[2023-04-18T21:57:21.426Z] Generate a javacore without -XXnosuballoc32bitmem
[2023-04-18T21:57:21.426Z] Verify that the sub allocator memory is listed in the javacore
[2023-04-18T21:57:21.426Z] Generate a javacore with -XXnosuballoc32bitmem
[2023-04-18T21:57:21.426Z] Verify that the sub allocator memory is not listed in the javacore on z/OS. All other platforms should use the sub-allocator when -XXnosuballoc32bitmem is used.
[2023-04-18T21:57:21.426Z] Verify -XX:MaxHeapSize -XX:InitialHeapSize -XX:ThreadStackSize
[2023-04-18T21:57:21.426Z] -----------------------------
[2023-04-18T21:57:21.426Z]
[2023-04-18T21:57:21.426Z] -----------------------------------
[2023-04-18T21:57:21.426Z] testXXArgumentTesting_0_PASSED
[2023-04-18T21:57:21.426Z] -----------------------------------
[2023-04-18T21:57:21.426Z]
[2023-04-18T21:57:21.426Z] TEST TEARDOWN:
[2023-04-18T21:57:21.426Z] Nothing to be done for teardown.
[2023-04-18T21:57:21.426Z] testXXArgumentTesting_0 Finish Time: Tue Apr 18 21:57:21 2023 Epoch Time (ms): 1681855041185