Post Test
[2024-08-08T11:28:02.984Z] gmake[4]: Leaving directory '/home/jenkins/workspace/Test_openjdk11_hs_sanity.openjdk_ppc64_aix_testList_1/aqa-tests/openjdk'
[2024-08-08T11:28:02.984Z] gmake[3]: Leaving directory '/home/jenkins/workspace/Test_openjdk11_hs_sanity.openjdk_ppc64_aix_testList_1/aqa-tests'
[2024-08-08T11:28:02.984Z]
[2024-08-08T11:28:02.984Z]
[2024-08-08T11:28:02.984Z] All tests finished, run result summary:
[2024-08-08T11:28:02.984Z] cd "/home/jenkins/workspace/Test_openjdk11_hs_sanity.openjdk_ppc64_aix_testList_1/aqa-tests/TKG/../TKG/scripts"; \
[2024-08-08T11:28:02.984Z] perl "resultsSum.pl" --failuremk="/home/jenkins/workspace/Test_openjdk11_hs_sanity.openjdk_ppc64_aix_testList_1/aqa-tests/TKG/../TKG/failedtargets.mk" --resultFile="/home/jenkins/workspace/Test_openjdk11_hs_sanity.openjdk_ppc64_aix_testList_1/aqa-tests/TKG/../TKG/output_17231104595515/TestTargetResult" --platFile="/home/jenkins/workspace/Test_openjdk11_hs_sanity.openjdk_ppc64_aix_testList_1/aqa-tests/TKG/../TKG/resources/buildPlatformMap.properties" --diagnostic=failure --jdkVersion=11 --jdkImpl=hotspot --jdkVendor="eclipse" --spec=aix_ppc-64 --buildList=openjdk --customTarget="" --testTarget=testList --tapPath=/home/jenkins/workspace/Test_openjdk11_hs_sanity.openjdk_ppc64_aix_testList_1/aqa-tests/TKG/../TKG/output_17231104595515/ --tapName=Test_openjdk11_hs_sanity.openjdk_ppc64_aix_testList_1.tap --comment=""
[2024-08-08T11:28:02.984Z]
[2024-08-08T11:28:02.984Z]
[2024-08-08T11:28:02.984Z] TEST TARGETS SUMMARY
[2024-08-08T11:28:02.984Z] ++++++++++++++++++++++++++++++++++++++++++++++++++++++++++++++++++++++++++
[2024-08-08T11:28:02.984Z] DISABLED test targets:
[2024-08-08T11:28:02.984Z] jdk_svc_sanity_0
[2024-08-08T11:28:02.984Z] jdk_svc_sanity_1
[2024-08-08T11:28:02.984Z] jdk_svc_sanity_2
[2024-08-08T11:28:02.984Z]
[2024-08-08T11:28:02.984Z] PASSED test targets:
[2024-08-08T11:28:02.984Z] hotspot_sanity_0 - Test results: passed: 4
[2024-08-08T11:28:02.984Z] jdk_math_0 - Test results: passed: 45
[2024-08-08T11:28:02.984Z] jdk_math_1 - Test results: passed: 45
[2024-08-08T11:28:02.984Z] jdk_security1_0 - Test results: passed: 209
[2024-08-08T11:28:02.984Z] jdk_security1_1 - Test results: passed: 209
[2024-08-08T11:28:02.984Z] jdk_security2_0 - Test results: passed: 220
[2024-08-08T11:28:02.984Z] jdk_security2_1 - Test results: passed: 220
[2024-08-08T11:28:02.984Z] jdk_security4_0 - Test results: passed: 139
[2024-08-08T11:28:02.984Z] jdk_security4_1 - Test results: passed: 139
[2024-08-08T11:28:02.984Z] jdk_util_0 - Test results: passed: 868
[2024-08-08T11:28:02.984Z] jdk11_tier1_buffer_0 - Test results: passed: 11
[2024-08-08T11:28:02.984Z] jdk11_tier1_buffer_1 - Test results: passed: 11
[2024-08-08T11:28:02.984Z] jdk11_tier1_iso8859_0 - Test results: passed: 1
[2024-08-08T11:28:02.984Z] jdk11_tier1_iso8859_1 - Test results: passed: 1
[2024-08-08T11:28:02.984Z] jdk11_tier1_pack200_0 - Test results: passed: 19
[2024-08-08T11:28:02.984Z] jdk11_tier1_pack200_1 - Test results: passed: 19
[2024-08-08T11:28:02.984Z]
[2024-08-08T11:28:02.984Z] TOTAL: 31 EXECUTED: 16 PASSED: 16 FAILED: 0 DISABLED: 3 SKIPPED: 12
[2024-08-08T11:28:02.984Z] ++++++++++++++++++++++++++++++++++++++++++++++++++++++++++++++++++++++++++
[2024-08-08T11:28:02.984Z]
[2024-08-08T11:28:02.984Z] TESTCASES RESULTS SUMMARY: passed: 2,160; failed: 0; error: 0; skipped: 0
[2024-08-08T11:28:02.984Z] ++++++++++++++++++++++++++++++++++++++++++++++++++++++++++++++++++++++++++
[2024-08-08T11:28:02.984Z] ALL TESTS PASSED
[2024-08-08T11:28:02.984Z]
[2024-08-08T11:28:02.984Z] _testList done
[2024-08-08T11:28:02.984Z] gmake[2]: Leaving directory '/home/jenkins/workspace/Test_openjdk11_hs_sanity.openjdk_ppc64_aix_testList_1/aqa-tests/TKG'
[2024-08-08T11:28:02.985Z] gmake[1]: Leaving directory '/home/jenkins/workspace/Test_openjdk11_hs_sanity.openjdk_ppc64_aix_testList_1/aqa-tests/TKG'
[Pipeline] sh
[2024-08-08T11:28:05.154Z] + uname
[2024-08-08T11:28:05.154Z] + [ AIX = AIX ]
[2024-08-08T11:28:05.154Z] + MAKE=gmake
[2024-08-08T11:28:05.154Z] + gmake -f ./aqa-tests/TKG/testEnv.mk testEnvTeardown
[2024-08-08T11:28:05.154Z] gmake: Nothing to be done for 'testEnvTeardown'.
[Pipeline] }
[Pipeline] // stage
[Pipeline] stage
[Pipeline] { (Post)
[Pipeline] step
[2024-08-08T11:28:05.827Z] TAP Reports Processing: START
[2024-08-08T11:28:05.828Z] Looking for TAP results report in workspace using pattern: aqa-tests/TKG/**/*.tap
[2024-08-08T11:28:10.343Z] Saving reports...
[2024-08-08T11:28:12.087Z] Processing '/home/jenkins/.jenkins/jobs/Test_openjdk11_hs_sanity.openjdk_ppc64_aix_testList_1/builds/7/tap-master-files/aqa-tests/TKG/output_17231104595515/Test_openjdk11_hs_sanity.openjdk_ppc64_aix_testList_1.tap'
[2024-08-08T11:28:12.087Z] Parsing TAP test result [/home/jenkins/.jenkins/jobs/Test_openjdk11_hs_sanity.openjdk_ppc64_aix_testList_1/builds/7/tap-master-files/aqa-tests/TKG/output_17231104595515/Test_openjdk11_hs_sanity.openjdk_ppc64_aix_testList_1.tap].
[2024-08-08T11:28:12.096Z] TAP Reports Processing: FINISH
[Pipeline] echo
[2024-08-08T11:28:12.108Z] Saving aqa-tests/testenv/testenv.properties file on jenkins.
[Pipeline] archiveArtifacts
[2024-08-08T11:28:12.285Z] Archiving artifacts
[2024-08-08T11:28:14.094Z] Recording fingerprints
[Pipeline] echo
[2024-08-08T11:28:14.461Z] Saving aqa-tests/TKG/**/*.tap file on jenkins.
[Pipeline] archiveArtifacts
[2024-08-08T11:28:14.635Z] Archiving artifacts
[2024-08-08T11:28:17.515Z] Recording fingerprints
[Pipeline] junit
[2024-08-08T11:28:19.378Z] Recording test results
[2024-08-08T11:28:46.040Z] [Checks API] No suitable checks publisher found.
[Pipeline] }
[Pipeline] // stage
[Pipeline] echo
[2024-08-08T11:28:46.078Z] PROCESSCATCH: Terminating any hung/left over test processes:
[Pipeline] sh
[2024-08-08T11:28:48.151Z] + aqa-tests/terminateTestProcesses.sh jenkins
[2024-08-08T11:28:48.151Z] + 2>& 1
[2024-08-08T11:28:48.151Z] Unix type machine..
[2024-08-08T11:28:48.151Z] jenkins 25231676 1 0 09:47:28 - 0:00 /usr/bin/X11/X -force -vfb -x abx -x dbe -x GLX -secIP 000 :0
[2024-08-08T11:28:48.151Z] Boooo - there are rogue processes kicking about
[2024-08-08T11:28:48.151Z] Issuing a kill to all processes shown above
[2024-08-08T11:28:48.151Z] Sleeping for 10 seconds...
[2024-08-08T11:28:57.904Z] Processes stopped successfully
[Pipeline] cleanWs
[2024-08-08T11:28:58.589Z] [WS-CLEANUP] Deleting project workspace...
[2024-08-08T11:28:58.589Z] [WS-CLEANUP] Deferred wipeout is disabled by the job configuration...
[2024-08-08T11:29:19.508Z] [WS-CLEANUP] done
[Pipeline] sh
[2024-08-08T11:29:21.507Z] + find /tmp -name *core* -print -exec rm -f {} ;
[2024-08-08T11:29:21.508Z] + 2> /dev/null
[2024-08-08T11:29:21.508Z] + true
[Pipeline] }
[Pipeline] // timeout
[Pipeline] }
[2024-08-09T10:02:30.512Z] Cancelling nested steps due to timeout
[Pipeline] sh
[2024-08-09T10:02:33.228Z] + uname
[2024-08-09T10:02:33.228Z] + [ AIX = AIX ]
[2024-08-09T10:02:33.228Z] + MAKE=gmake
[2024-08-09T10:02:33.228Z] + gmake -f ./aqa-tests/TKG/testEnv.mk testEnvTeardown
[2024-08-09T10:02:33.228Z] gmake: Nothing to be done for 'testEnvTeardown'.
[Pipeline] }
[Pipeline] // stage
[Pipeline] stage
[Pipeline] { (Post)
[Pipeline] step
[2024-08-09T10:02:34.285Z] TAP Reports Processing: START
[2024-08-09T10:02:34.286Z] Looking for TAP results report in workspace using pattern: aqa-tests/TKG/**/*.tap
[2024-08-09T10:02:36.202Z] Saving reports...
[2024-08-09T10:02:36.387Z] Processing '/home/jenkins/.jenkins/jobs/Test_openjdk11_hs_sanity.openjdk_ppc64_aix_testList_1/builds/7/tap-master-files/aqa-tests/TKG/output_17231080753431/Test_openjdk11_hs_sanity.openjdk_ppc64_aix_testList_1.tap'
[2024-08-09T10:02:36.387Z] Parsing TAP test result [/home/jenkins/.jenkins/jobs/Test_openjdk11_hs_sanity.openjdk_ppc64_aix_testList_1/builds/7/tap-master-files/aqa-tests/TKG/output_17231080753431/Test_openjdk11_hs_sanity.openjdk_ppc64_aix_testList_1.tap].
[2024-08-09T10:02:36.391Z] Processing '/home/jenkins/.jenkins/jobs/Test_openjdk11_hs_sanity.openjdk_ppc64_aix_testList_1/builds/7/tap-master-files/aqa-tests/TKG/output_17231104595515/Test_openjdk11_hs_sanity.openjdk_ppc64_aix_testList_1.tap'
[2024-08-09T10:02:36.391Z] Parsing TAP test result [/home/jenkins/.jenkins/jobs/Test_openjdk11_hs_sanity.openjdk_ppc64_aix_testList_1/builds/7/tap-master-files/aqa-tests/TKG/output_17231104595515/Test_openjdk11_hs_sanity.openjdk_ppc64_aix_testList_1.tap].
[2024-08-09T10:02:36.397Z] There are failed test cases. Marking build as UNSTABLE
[2024-08-09T10:02:36.416Z] TAP Reports Processing: FINISH
[Pipeline] echo
[2024-08-09T10:02:36.423Z] Saving aqa-tests/testenv/testenv.properties file on jenkins.
[Pipeline] archiveArtifacts
[2024-08-09T10:02:36.600Z] Archiving artifacts
[2024-08-09T10:02:36.951Z] Recording fingerprints
[Pipeline] echo
[2024-08-09T10:02:37.139Z] Saving aqa-tests/TKG/**/*.tap file on jenkins.
[Pipeline] archiveArtifacts
[2024-08-09T10:02:37.317Z] Archiving artifacts
[2024-08-09T10:02:39.221Z] Recording fingerprints
[Pipeline] sh
[2024-08-09T10:02:42.809Z] + tar -cf - ./aqa-tests/TKG/output_17231080753431
[2024-08-09T10:02:42.809Z] + 1> openjdk_test_output.tar.gz
[2024-08-09T10:02:42.809Z] + pigz -9
[2024-08-09T10:02:42.809Z] + 2> /dev/null
[2024-08-09T10:02:42.809Z] + gzip -9
[Pipeline] echo
[2024-08-09T10:02:54.716Z] ARTIFACTORY_SERVER is not set. Saving artifacts on jenkins.
[Pipeline] archiveArtifacts
[2024-08-09T10:02:54.894Z] Archiving artifacts
[2024-08-09T10:03:20.188Z] Recording fingerprints
[Pipeline] findFiles
[Pipeline] echo
[2024-08-09T10:03:27.395Z] Tap file found: aqa-tests/TKG/output_17231080753431/Test_openjdk11_hs_sanity.openjdk_ppc64_aix_testList_1.tap...
[Pipeline] readFile
[Pipeline] echo
[2024-08-09T10:03:27.659Z] Rerun in Grinder with failed test targets: https://ci.adoptium.net/job/Grinder/parambuild/?SDK_RESOURCE=upstream&TARGET=testList+TESTLIST=jdk_math_1&BASE_DOCKER_REGISTRY_CREDENTIAL_ID=&TEST_FLAG=&UPSTREAM_TEST_JOB_NAME=Test_openjdk11_hs_sanity.openjdk_ppc64_aix&DOCKER_REQUIRED=false&ACTIVE_NODE_TIMEOUT=5&VENDOR_TEST_DIRS=&EXTRA_DOCKER_ARGS=&TKG_OWNER_BRANCH=adoptium%3Amaster&OPENJ9_SYSTEMTEST_OWNER_BRANCH=eclipse%3Amaster&PLATFORM=ppc64_aix&GENERATE_JOBS=true&KEEP_REPORTDIR=true&PERSONAL_BUILD=false&DOCKER_REGISTRY_DIR=&RERUN_ITERATIONS=1&ADOPTOPENJDK_REPO=https%3A%2F%2Fgithub.com%2Fadoptium%2Faqa-tests.git&SETUP_JCK_RUN=false&DOCKER_REGISTRY_URL_CREDENTIAL_ID=&LABEL=&EXTRA_OPTIONS=&CUSTOMIZED_SDK_URL=&BUILD_IDENTIFIER=&JENKINS_KEY=&ADOPTOPENJDK_BRANCH=master&LIGHT_WEIGHT_CHECKOUT=true&USE_JRE=false&ARTIFACTORY_SERVER=&KEEP_WORKSPACE=false&USER_CREDENTIALS_ID=&JDK_VERSION=11&DOCKER_REGISTRY_URL=&ITERATIONS=1&VENDOR_TEST_REPOS=&JDK_REPO=https%3A%2F%2Fgithub.com%2Fadoptium%2Fjdk11u&JCK_GIT_BRANCH=master&OPENJ9_BRANCH=master&OPENJ9_SHA=&JCK_GIT_REPO=&VENDOR_TEST_BRANCHES=&UPSTREAM_JOB_NAME=build-scripts%2Fjobs%2Fjdk11u%2Fjdk11u-aix-ppc64-temurin&OPENJ9_REPO=https%3A%2F%2Fgithub.com%2Feclipse-openj9%2Fopenj9.git&CLOUD_PROVIDER=&CUSTOM_TARGET=&VENDOR_TEST_SHAS=&JDK_BRANCH=jdk-11.0.25%2B2_adopt&LABEL_ADDITION=sw.os.aix.7_2&ARTIFACTORY_REPO=&ARTIFACTORY_ROOT_DIR=&UPSTREAM_TEST_JOB_NUMBER=691&DOCKERIMAGE_TAG=&TEST_TIME=&JDK_IMPL=hotspot&SSH_AGENT_CREDENTIAL=&AUTO_DETECT=true&SLACK_CHANNEL=&DYNAMIC_COMPILE=false&RELATED_NODES=&ADOPTOPENJDK_SYSTEMTEST_OWNER_BRANCH=adoptium%3Amaster&APPLICATION_OPTIONS=&CUSTOMIZED_SDK_URL_CREDENTIAL_ID=eclipse_temurin_bot_email_and_token&ARCHIVE_TEST_RESULTS=false&NUM_MACHINES=&OPENJDK_SHA=&TRSS_URL=&USE_TESTENV_PROPERTIES=false&BUILD_LIST=openjdk&ADDITIONAL_ARTIFACTS_REQUIRED=&UPSTREAM_JOB_NUMBER=370&STF_OWNER_BRANCH=adoptium%3Amaster&TIME_LIMIT=25&JVM_OPTIONS=&PARALLEL=None
[Pipeline] echo
[2024-08-09T10:03:27.796Z] Rerun failed jdk test cases in Grinder with jdk_custom target: https://ci.adoptium.net/job/Grinder/parambuild/?SDK_RESOURCE=upstream&TARGET=jdk_custom&BASE_DOCKER_REGISTRY_CREDENTIAL_ID=&TEST_FLAG=&UPSTREAM_TEST_JOB_NAME=Test_openjdk11_hs_sanity.openjdk_ppc64_aix&DOCKER_REQUIRED=false&ACTIVE_NODE_TIMEOUT=5&VENDOR_TEST_DIRS=&EXTRA_DOCKER_ARGS=&TKG_OWNER_BRANCH=adoptium%3Amaster&OPENJ9_SYSTEMTEST_OWNER_BRANCH=eclipse%3Amaster&PLATFORM=ppc64_aix&GENERATE_JOBS=true&KEEP_REPORTDIR=true&PERSONAL_BUILD=false&DOCKER_REGISTRY_DIR=&RERUN_ITERATIONS=1&ADOPTOPENJDK_REPO=https%3A%2F%2Fgithub.com%2Fadoptium%2Faqa-tests.git&SETUP_JCK_RUN=false&DOCKER_REGISTRY_URL_CREDENTIAL_ID=&LABEL=&EXTRA_OPTIONS=&CUSTOMIZED_SDK_URL=&BUILD_IDENTIFIER=&JENKINS_KEY=&ADOPTOPENJDK_BRANCH=master&LIGHT_WEIGHT_CHECKOUT=true&USE_JRE=false&ARTIFACTORY_SERVER=&KEEP_WORKSPACE=false&USER_CREDENTIALS_ID=&JDK_VERSION=11&DOCKER_REGISTRY_URL=&ITERATIONS=1&VENDOR_TEST_REPOS=&JDK_REPO=https%3A%2F%2Fgithub.com%2Fadoptium%2Fjdk11u&JCK_GIT_BRANCH=master&OPENJ9_BRANCH=master&OPENJ9_SHA=&JCK_GIT_REPO=&VENDOR_TEST_BRANCHES=&UPSTREAM_JOB_NAME=build-scripts%2Fjobs%2Fjdk11u%2Fjdk11u-aix-ppc64-temurin&OPENJ9_REPO=https%3A%2F%2Fgithub.com%2Feclipse-openj9%2Fopenj9.git&CLOUD_PROVIDER=&CUSTOM_TARGET=java%2Fmath%2FBigInteger%2FlargeMemory%2FSymmetricRangeTests.java&VENDOR_TEST_SHAS=&JDK_BRANCH=jdk-11.0.25%2B2_adopt&LABEL_ADDITION=sw.os.aix.7_2&ARTIFACTORY_REPO=&ARTIFACTORY_ROOT_DIR=&UPSTREAM_TEST_JOB_NUMBER=691&DOCKERIMAGE_TAG=&TEST_TIME=&JDK_IMPL=hotspot&SSH_AGENT_CREDENTIAL=&AUTO_DETECT=true&SLACK_CHANNEL=&DYNAMIC_COMPILE=false&RELATED_NODES=&ADOPTOPENJDK_SYSTEMTEST_OWNER_BRANCH=adoptium%3Amaster&APPLICATION_OPTIONS=&CUSTOMIZED_SDK_URL_CREDENTIAL_ID=eclipse_temurin_bot_email_and_token&ARCHIVE_TEST_RESULTS=false&NUM_MACHINES=&OPENJDK_SHA=&TRSS_URL=&USE_TESTENV_PROPERTIES=false&BUILD_LIST=openjdk&ADDITIONAL_ARTIFACTS_REQUIRED=&UPSTREAM_JOB_NUMBER=370&STF_OWNER_BRANCH=adoptium%3Amaster&TIME_LIMIT=25&JVM_OPTIONS=&PARALLEL=None
[Pipeline] junit
[2024-08-09T10:03:27.993Z] Recording test results
[2024-08-09T10:03:30.515Z] Body did not finish within grace period; terminating with extreme prejudice
[Pipeline] echo
[2024-08-09T10:03:30.519Z] Caught exception: null
[Pipeline] }
[Pipeline] // stage
[Pipeline] echo
[2024-08-09T10:03:30.581Z] PROCESSCATCH: Terminating any hung/left over test processes:
[Pipeline] sh
[2024-08-09T10:03:32.448Z] + aqa-tests/terminateTestProcesses.sh jenkins
[2024-08-09T10:03:32.448Z] + 2>& 1
[2024-08-09T10:03:32.448Z] Unix type machine..
[2024-08-09T10:03:32.448Z] jenkins 30212362 1 0 Aug 08 - 0:00 /usr/bin/X11/X -force -vfb -x abx -x dbe -x GLX -secIP 000 :0
[2024-08-09T10:03:32.448Z] Boooo - there are rogue processes kicking about
[2024-08-09T10:03:32.448Z] Issuing a kill to all processes shown above
[2024-08-09T10:03:32.448Z] Sleeping for 10 seconds...
[2024-08-09T10:03:42.237Z] Processes stopped successfully
[Pipeline] cleanWs
[2024-08-09T10:03:42.939Z] [WS-CLEANUP] Deleting project workspace...
[2024-08-09T10:03:42.939Z] [WS-CLEANUP] Deferred wipeout is disabled by the job configuration...
[2024-08-09T10:03:55.080Z] [Checks API] No suitable checks publisher found.
[2024-08-09T10:04:03.577Z] [WS-CLEANUP] done
[Pipeline] sh
[2024-08-09T10:04:05.585Z] + find /tmp -name *core* -print -exec rm -f {} ;
[2024-08-09T10:04:05.585Z] + 2> /dev/null
[2024-08-09T10:04:05.585Z] + true
[Pipeline] }
[Pipeline] // timeout
[Pipeline] }
[Pipeline] // node
[Pipeline] // node
[Pipeline] }
[Pipeline] // stage
[Pipeline] }
[Pipeline] // timestamps
[Pipeline] End of Pipeline
Also: org.jenkinsci.plugins.workflow.actions.ErrorAction$ErrorId: a5870882-ac2b-4fb5-a50e-79ebc555e56a
java.lang.NullPointerException: Cannot read field "lease" because "c" is null
at PluginClassLoader for workflow-durable-task-step//org.jenkinsci.plugins.workflow.support.steps.ExecutorStepDynamicContext$WorkspaceListLeaseTranslator.get(ExecutorStepDynamicContext.java:210)
at PluginClassLoader for workflow-durable-task-step//org.jenkinsci.plugins.workflow.support.steps.ExecutorStepExecution$PlaceholderTask$Callback.finished(ExecutorStepExecution.java:994)
at PluginClassLoader for workflow-step-api//org.jenkinsci.plugins.workflow.steps.BodyExecutionCallback$TailCall.onSuccess(BodyExecutionCallback.java:119)
at PluginClassLoader for workflow-cps//org.jenkinsci.plugins.workflow.cps.CpsBodyExecution$SuccessAdapter.receive(CpsBodyExecution.java:375)
at PluginClassLoader for workflow-cps//com.cloudbees.groovy.cps.impl.ValueBoundContinuation.receive(ValueBoundContinuation.java:21)
at PluginClassLoader for workflow-cps//com.cloudbees.groovy.cps.Block$Noop.eval(Block.java:30)
at PluginClassLoader for workflow-cps//com.cloudbees.groovy.cps.Next.step(Next.java:83)
at PluginClassLoader for workflow-cps//com.cloudbees.groovy.cps.Continuable.run0(Continuable.java:147)
at PluginClassLoader for workflow-cps//org.jenkinsci.plugins.workflow.cps.SandboxContinuable.access$001(SandboxContinuable.java:17)
at PluginClassLoader for workflow-cps//org.jenkinsci.plugins.workflow.cps.SandboxContinuable.run0(SandboxContinuable.java:49)
at PluginClassLoader for workflow-cps//org.jenkinsci.plugins.workflow.cps.CpsThread.runNextChunk(CpsThread.java:180)
at PluginClassLoader for workflow-cps//org.jenkinsci.plugins.workflow.cps.CpsThreadGroup.run(CpsThreadGroup.java:423)
at PluginClassLoader for workflow-cps//org.jenkinsci.plugins.workflow.cps.CpsThreadGroup$2.call(CpsThreadGroup.java:331)
at PluginClassLoader for workflow-cps//org.jenkinsci.plugins.workflow.cps.CpsThreadGroup$2.call(CpsThreadGroup.java:295)
at PluginClassLoader for workflow-cps//org.jenkinsci.plugins.workflow.cps.CpsVmExecutorService.lambda$wrap$4(CpsVmExecutorService.java:136)
at java.base/java.util.concurrent.FutureTask.run(FutureTask.java:264)
at hudson.remoting.SingleLaneExecutorService$1.run(SingleLaneExecutorService.java:139)
at jenkins.util.ContextResettingExecutorService$1.run(ContextResettingExecutorService.java:28)
at jenkins.security.ImpersonatingExecutorService$1.run(ImpersonatingExecutorService.java:68)
at jenkins.util.ErrorLoggingExecutorService.lambda$wrap$0(ErrorLoggingExecutorService.java:51)
at java.base/java.util.concurrent.Executors$RunnableAdapter.call(Executors.java:539)
at java.base/java.util.concurrent.FutureTask.run(FutureTask.java:264)
at java.base/java.util.concurrent.ThreadPoolExecutor.runWorker(ThreadPoolExecutor.java:1136)
at java.base/java.util.concurrent.ThreadPoolExecutor$Worker.run(ThreadPoolExecutor.java:635)
at PluginClassLoader for workflow-cps//org.jenkinsci.plugins.workflow.cps.CpsVmExecutorService$1.call(CpsVmExecutorService.java:53)
at PluginClassLoader for workflow-cps//org.jenkinsci.plugins.workflow.cps.CpsVmExecutorService$1.call(CpsVmExecutorService.java:50)
at org.codehaus.groovy.runtime.GroovyCategorySupport$ThreadCategoryInfo.use(GroovyCategorySupport.java:136)
at org.codehaus.groovy.runtime.GroovyCategorySupport.use(GroovyCategorySupport.java:275)
at PluginClassLoader for workflow-cps//org.jenkinsci.plugins.workflow.cps.CpsVmExecutorService.lambda$categoryThreadFactory$0(CpsVmExecutorService.java:50)
at java.base/java.lang.Thread.run(Thread.java:840)
/home/jenkins/.jenkins/workspace/Test_openjdk11_hs_sanity.openjdk_ppc64_aix_testList_1@tmp/jfrog/7/.jfrog deleted
Finished: FAILURE