jdk_custom_0
[2024-11-14T12:25:52.376Z] Running test jdk_custom_0 ...
[2024-11-14T12:25:52.376Z] ===============================================
[2024-11-14T12:25:52.376Z] jdk_custom_0 Start Time: Thu Nov 14 12:25:52 2024 Epoch Time (ms): 1731587152121
[2024-11-14T12:25:52.376Z] variation: NoOptions
[2024-11-14T12:25:52.376Z] JVM_OPTIONS:
[2024-11-14T12:25:52.376Z] { \
[2024-11-14T12:25:52.376Z] echo ""; echo "TEST SETUP:"; \
[2024-11-14T12:25:52.376Z] echo "Nothing to be done for setup."; \
[2024-11-14T12:25:52.376Z] mkdir -p "/Users/jenkins/workspace/Test_openjdk11_hs_extended.openjdk_x86-64_mac_rerun/aqa-tests/TKG/../TKG/output_17315871514520/jdk_custom_0"; \
[2024-11-14T12:25:52.376Z] cd "/Users/jenkins/workspace/Test_openjdk11_hs_extended.openjdk_x86-64_mac_rerun/aqa-tests/TKG/../TKG/output_17315871514520/jdk_custom_0"; \
[2024-11-14T12:25:52.376Z] echo ""; echo "TESTING:"; \
[2024-11-14T12:25:52.377Z] "/Users/jenkins/workspace/Test_openjdk11_hs_extended.openjdk_x86-64_mac_rerun/jdkbinary/j2sdk-image/Contents/Home/bin/..//bin/java" -Xmx512m -jar "/Users/jenkins/workspace/Test_openjdk11_hs_extended.openjdk_x86-64_mac_rerun/aqa-tests/TKG/../../jvmtest/openjdk/jtreg/lib/jtreg.jar" \
[2024-11-14T12:25:52.377Z] -agentvm -a -ea -esa -v:fail,error,time,nopass -retain:fail,error,*.dmp,javacore.*,heapdump.*,*.trc -ignore:quiet -timeoutFactor:8 -xml:verify -concurrency:5 -nativepath:"/Users/jenkins/workspace/Test_openjdk11_hs_extended.openjdk_x86-64_mac_rerun/jdkbinary/openjdk-test-image/jdk/jtreg/native" -vmoptions:"-Xmx512m " \
[2024-11-14T12:25:52.377Z] \
[2024-11-14T12:25:52.377Z] -w ""/Users/jenkins/workspace/Test_openjdk11_hs_extended.openjdk_x86-64_mac_rerun/aqa-tests/TKG/../TKG/output_17315871514520/jdk_custom_0"/work" \
[2024-11-14T12:25:52.377Z] -r ""/Users/jenkins/workspace/Test_openjdk11_hs_extended.openjdk_x86-64_mac_rerun/aqa-tests/TKG/../TKG/output_17315871514520/jdk_custom_0"/report" \
[2024-11-14T12:25:52.377Z] -jdk:"/Users/jenkins/workspace/Test_openjdk11_hs_extended.openjdk_x86-64_mac_rerun/jdkbinary/j2sdk-image/Contents/Home/bin/../" \
[2024-11-14T12:25:52.377Z] /Users/jenkins/workspace/Test_openjdk11_hs_extended.openjdk_x86-64_mac_rerun/aqa-tests/TKG/../openjdk/openjdk-jdk/test/jdk/java/nio/channels/DatagramChannel/BasicMulticastTests.java /Users/jenkins/workspace/Test_openjdk11_hs_extended.openjdk_x86-64_mac_rerun/aqa-tests/TKG/../openjdk/openjdk-jdk/test/jdk/java/time/test/java/time/format/TestUTCParse.java; \
[2024-11-14T12:25:52.377Z] if [ $? -eq 0 ]; then echo "-----------------------------------"; echo "jdk_custom_0""_PASSED"; echo "-----------------------------------"; cd /Users/jenkins/workspace/Test_openjdk11_hs_extended.openjdk_x86-64_mac_rerun/aqa-tests/TKG/..; else echo "-----------------------------------"; echo "jdk_custom_0""_FAILED"; echo "-----------------------------------"; fi; \
[2024-11-14T12:25:52.377Z] echo ""; echo "TEST TEARDOWN:"; \
[2024-11-14T12:25:52.377Z] echo "Nothing to be done for teardown."; \
[2024-11-14T12:25:52.377Z] } 2>&1 | tee -a "/Users/jenkins/workspace/Test_openjdk11_hs_extended.openjdk_x86-64_mac_rerun/aqa-tests/TKG/../TKG/output_17315871514520/TestTargetResult";
[2024-11-14T12:25:52.377Z]
[2024-11-14T12:25:52.377Z] TEST SETUP:
[2024-11-14T12:25:52.377Z] Nothing to be done for setup.
[2024-11-14T12:25:52.377Z]
[2024-11-14T12:25:52.377Z] TESTING:
[2024-11-14T12:25:53.142Z] Directory "/Users/jenkins/workspace/Test_openjdk11_hs_extended.openjdk_x86-64_mac_rerun/aqa-tests/TKG/../TKG/output_17315871514520/jdk_custom_0/work" not found: creating
[2024-11-14T12:25:53.142Z] Directory "/Users/jenkins/workspace/Test_openjdk11_hs_extended.openjdk_x86-64_mac_rerun/aqa-tests/TKG/../TKG/output_17315871514520/jdk_custom_0/report" not found: creating
[2024-11-14T12:25:58.147Z] XML output with verification to /Users/jenkins/workspace/Test_openjdk11_hs_extended.openjdk_x86-64_mac_rerun/aqa-tests/TKG/output_17315871514520/jdk_custom_0/work
[2024-11-14T12:26:14.498Z] --------------------------------------------------
[2024-11-14T12:26:14.498Z] TEST: java/time/test/java/time/format/TestUTCParse.java
[2024-11-14T12:26:14.498Z] TEST JDK: /Users/jenkins/workspace/Test_openjdk11_hs_extended.openjdk_x86-64_mac_rerun/jdkbinary/j2sdk-image/Contents/Home/bin/..
[2024-11-14T12:26:14.498Z]
[2024-11-14T12:26:14.498Z] ACTION: build -- Passed. Build successful
[2024-11-14T12:26:14.498Z] REASON: Named class compiled on demand
[2024-11-14T12:26:14.498Z] TIME: 14.319 seconds
[2024-11-14T12:26:14.498Z] messages:
[2024-11-14T12:26:14.498Z] command: build jdk.test.lib.RandomFactory test.java.util.TestFormatter test.java.time.TestOffsetDateTime test.java.time.temporal.TestChronoUnit test.java.time.temporal.MockFieldValue test.java.time.temporal.TestJulianFields test.java.time.temporal.TestDateTimeBuilderCombinations test.java.time.temporal.TestChronoField test.java.time.temporal.MockFieldNoValue test.java.time.temporal.TestDateTimeValueRange test.java.time.temporal.TestIsoWeekFields test.java.time.TestClock_System test.java.time.TestClock_Fixed test.java.time.chrono.TestServiceLoader test.java.time.chrono.TestEraDisplayName test.java.time.chrono.TestUmmAlQuraChronology test.java.time.chrono.TestThaiBuddhistChronoImpl test.java.time.chrono.TestExampleCode test.java.time.chrono.TestIsoChronoImpl test.java.time.chrono.TestChronoLocalDate test.java.time.chrono.TestChronologyPerf test.java.time.chrono.TestJapaneseChronology test.java.time.chrono.TestJapaneseChronoImpl test.java.time.TestInstant test.java.time.TestOffsetTime test.java.time.zone.TestZoneRules test.java.time.zone.TestFixedZoneRules test.java.time.TestLocalDate test.java.time.TestYear test.java.time.TestMonthDay test.java.time.TestClock_Offset test.java.time.MockSimplePeriod test.java.time.TestZoneId test.java.time.TestLocalDateTime test.java.time.TestOffsetDateTime_instants test.java.time.TestZoneOffset test.java.time.format.TestReducedParser test.java.time.format.TestStringLiteralParser test.java.time.format.TestCharLiteralParser test.java.time.format.AbstractTestPrinterParser test.java.time.format.TestNumberParser test.java.time.format.TestZoneOffsetParser test.java.time.format.TestDateTimeParsing test.java.time.format.TestCharLiteralPrinter test.java.time.format.TestDateTimeTextProviderWithLocale test.java.time.format.TestReducedPrinter test.java.time.format.TestUTCParse test.java.time.format.TestPadPrinterDecorator test.java.time.format.TestDateTimeTextProvider test.java.time.format.TestDateTimeFormatterBuilder test.java.time.format.TestDateTimeFormatter test.java.time.format.TestNarrowMonthNamesAndDayNames test.java.time.format.TestTextParser test.java.time.format.TestDecimalStyle test.java.time.format.TestStringLiteralPrinter test.java.time.format.TestTextParserWithLocale test.java.time.format.TestTextPrinter test.java.time.format.MockIOExceptionAppendable test.java.time.format.TestSettingsParser test.java.time.format.TestUnicodeExtension test.java.time.format.TestFractionPrinterParser test.java.time.format.ZoneName test.java.time.format.TestNumberPrinter test.java.time.format.TestZoneTextPrinterParser test.java.time.format.TestNonIsoFormatter test.java.time.format.TestDateTimeFormatterBuilderWithLocale test.java.time.format.TestZoneOffsetPrinter test.java.time.format.TestTextPrinterWithLocale test.java.time.AbstractTest test.java.time.TestDuration test.java.time.TestYearMonth test.java.time.TestZonedDateTime test.java.time.TestClock_Tick test.java.time.TestLocalTime test.java.time.TestPeriod tck.java.time.TCKMonthDay tck.java.time.temporal.TCKWeekFields tck.java.time.temporal.TCKChronoUnit tck.java.time.temporal.TCKJulianFields tck.java.time.temporal.TCKTemporalAdjusters tck.java.time.temporal.TCKChronoField tck.java.time.temporal.TCKIsoFields tck.java.time.temporal.serial.TCKJulianFieldsSerialization tck.java.time.temporal.serial.TCKValueRangeSerialization tck.java.time.temporal.serial.TCKWeekFieldsSerialization tck.java.time.temporal.serial.TCKChronoUnitSerialization tck.java.time.temporal.serial.TCKChronoFieldSerialization tck.java.time.TCKDayOfWeek tck.java.time.TCKOffsetTime tck.java.time.TCKZonedDateTime tck.java.time.chrono.TCKJapaneseChronology tck.java.time.chrono.TCKTestServiceLoader tck.java.time.chrono.CopticDate tck.java.time.chrono.TCKThaiBuddhistChronology tck.java.time.chrono.TCKChronoLocalDateTime tck.java.time.chrono.TCKMinguoEra tck.java.time.chrono.TCKChronoZonedDateTime tck.java.time.chrono.TCKJapaneseEra tck.java.time.chrono.TCKHijrahChronology tck.java.time.chrono.TCKHijrahEra tck.java.time.chrono.TCKChronology tck.java.time.chrono.TCKIsoEra tck.java.time.chrono.CopticChronology tck.java.time.chrono.TCKChronoLocalDate tck.java.time.chrono.TCKThaiBuddhistEra tck.java.time.chrono.TCKIsoChronology tck.java.time.chrono.TCKMinguoChronology tck.java.time.chrono.CopticEra tck.java.time.chrono.TCKChronoPeriod tck.java.time.chrono.serial.TCKChronoZonedDateTimeSerialization tck.java.time.chrono.serial.TCKCopticSerialization tck.java.time.chrono.serial.TCKEraSerialization tck.java.time.chrono.serial.TCKChronoLocalDateSerialization tck.java.time.chrono.serial.TCKChronoLocalDateTimeSerialization tck.java.time.chrono.serial.TCKChronologySerialization tck.java.time.TCKClock_System tck.java.time.TCKLocalDateTime tck.java.time.zone.TCKZoneRulesProvider tck.java.time.zone.TCKZoneOffsetTransitionRule tck.java.time.zone.TCKFixedZoneRules tck.java.time.zone.TCKZoneRules tck.java.time.zone.serial.TCKZoneRulesSerialization tck.java.time.zone.serial.TCKZoneOffsetTransitionRuleSerialization tck.java.time.zone.serial.TCKFixedZoneRulesSerialization tck.java.time.zone.serial.TCKZoneOffsetTransitionSerialization tck.java.time.zone.TCKZoneOffsetTransition tck.java.time.TestIsoChronology tck.java.time.TCKClock_Offset tck.java.time.TCKClock tck.java.time.TCKLocalTime tck.java.time.TCKMonth tck.java.time.TCKInstant tck.java.time.TCKYearMonth tck.java.time.MockSimplePeriod tck.java.time.AbstractDateTimeTest tck.java.time.TCKZoneId tck.java.time.TCKClock_Tick tck.java.time.TCKDuration tck.java.time.format.TCKTextStyle tck.java.time.format.TCKSignStyle tck.java.time.format.TCKFormatStyle tck.java.time.format.TCKOffsetPrinterParser tck.java.time.format.TCKDTFParsedInstant tck.java.time.format.TCKDateTimeFormatters tck.java.time.format.TCKLocalizedPrinterParser tck.java.time.format.TCKChronoPrinterParser tck.java.time.format.TCKDecimalStyle tck.java.time.format.TCKLocalizedOffsetIdPrinterParser tck.java.time.format.TCKPadPrinterParser tck.java.time.format.TCKDateTimeFormatter tck.java.time.format.TCKLocalizedFieldPrinter tck.java.time.format.TCKDateTimeFormatterBuilder tck.java.time.format.TCKResolverStyle tck.java.time.format.TCKLocalizedFieldParser tck.java.time.format.TCKZoneIdPrinterParser tck.java.time.format.TCKInstantPrinterParser tck.java.time.format.TCKDateTimeParseResolver tck.java.time.format.TCKDateTimeTextPrinting tck.java.time.TCKClock_Fixed tck.java.time.TCKYear tck.java.time.TCKZoneOffset tck.java.time.TCKLocalDate tck.java.time.AbstractTCKTest tck.java.time.serial.TCKLocalDateTimeSerialization tck.java.time.serial.TCKDurationSerialization tck.java.time.serial.TCKPeriodSerialization tck.java.time.serial.TCKYearSerialization tck.java.time.serial.TCKZoneOffsetSerialization tck.java.time.serial.TCKZonedDateTimeSerialization tck.java.time.serial.TCKOffsetDateTimeSerialization tck.java.time.serial.TCKClockSerialization tck.java.time.serial.TCKLocalDateSerialization tck.java.time.serial.TCKYearMonthSerialization tck.java.time.serial.TCKZoneIdSerialization tck.java.time.serial.TCKInstantSerialization tck.java.time.serial.TCKLocalTimeSerialization tck.java.time.serial.TCKOffsetTimeSerialization tck.java.time.serial.TCKMonthDaySerialization tck.java.time.TCKOffsetDateTime tck.java.time.TCKPeriod nontestng.java.time.chrono.Bug8178823
[2024-11-14T12:26:14.498Z] reason: Named class compiled on demand
[2024-11-14T12:26:14.498Z] started: Thu Nov 14 12:25:58 GMT 2024
[2024-11-14T12:26:14.498Z] Library /test/lib:
[2024-11-14T12:26:14.498Z] compile: jdk.test.lib.RandomFactory
[2024-11-14T12:26:14.498Z] Test directory:
[2024-11-14T12:26:14.498Z] compile: test.java.util.TestFormatter, test.java.time.TestOffsetDateTime, test.java.time.temporal.TestChronoUnit, test.java.time.temporal.MockFieldValue, test.java.time.temporal.TestJulianFields, test.java.time.temporal.TestDateTimeBuilderCombinations, test.java.time.temporal.TestChronoField, test.java.time.temporal.MockFieldNoValue, test.java.time.temporal.TestDateTimeValueRange, test.java.time.temporal.TestIsoWeekFields, test.java.time.TestClock_System, test.java.time.TestClock_Fixed, test.java.time.chrono.TestServiceLoader, test.java.time.chrono.TestEraDisplayName, test.java.time.chrono.TestUmmAlQuraChronology, test.java.time.chrono.TestThaiBuddhistChronoImpl, test.java.time.chrono.TestExampleCode, test.java.time.chrono.TestIsoChronoImpl, test.java.time.chrono.TestChronoLocalDate, test.java.time.chrono.TestChronologyPerf, test.java.time.chrono.TestJapaneseChronology, test.java.time.chrono.TestJapaneseChronoImpl, test.java.time.TestInstant, test.java.time.TestOffsetTime, test.java.time.zone.TestZoneRules, test.java.time.zone.TestFixedZoneRules, test.java.time.TestLocalDate, test.java.time.TestYear, test.java.time.TestMonthDay, test.java.time.TestClock_Offset, test.java.time.MockSimplePeriod, test.java.time.TestZoneId, test.java.time.TestLocalDateTime, test.java.time.TestOffsetDateTime_instants, test.java.time.TestZoneOffset, test.java.time.format.TestReducedParser, test.java.time.format.TestStringLiteralParser, test.java.time.format.TestCharLiteralParser, test.java.time.format.AbstractTestPrinterParser, test.java.time.format.TestNumberParser, test.java.time.format.TestZoneOffsetParser, test.java.time.format.TestDateTimeParsing, test.java.time.format.TestCharLiteralPrinter, test.java.time.format.TestDateTimeTextProviderWithLocale, test.java.time.format.TestReducedPrinter, test.java.time.format.TestUTCParse, test.java.time.format.TestPadPrinterDecorator, test.java.time.format.TestDateTimeTextProvider, test.java.time.format.TestDateTimeFormatterBuilder, test.java.time.format.TestDateTimeFormatter, test.java.time.format.TestNarrowMonthNamesAndDayNames, test.java.time.format.TestTextParser, test.java.time.format.TestDecimalStyle, test.java.time.format.TestStringLiteralPrinter, test.java.time.format.TestTextParserWithLocale, test.java.time.format.TestTextPrinter, test.java.time.format.MockIOExceptionAppendable, test.java.time.format.TestSettingsParser, test.java.time.format.TestUnicodeExtension, test.java.time.format.TestFractionPrinterParser, test.java.time.format.ZoneName, test.java.time.format.TestNumberPrinter, test.java.time.format.TestZoneTextPrinterParser, test.java.time.format.TestNonIsoFormatter, test.java.time.format.TestDateTimeFormatterBuilderWithLocale, test.java.time.format.TestZoneOffsetPrinter, test.java.time.format.TestTextPrinterWithLocale, test.java.time.AbstractTest, test.java.time.TestDuration, test.java.time.TestYearMonth, test.java.time.TestZonedDateTime, test.java.time.TestClock_Tick, test.java.time.TestLocalTime, test.java.time.TestPeriod, tck.java.time.TCKMonthDay, tck.java.time.temporal.TCKWeekFields, tck.java.time.temporal.TCKChronoUnit, tck.java.time.temporal.TCKJulianFields, tck.java.time.temporal.TCKTemporalAdjusters, tck.java.time.temporal.TCKChronoField, tck.java.time.temporal.TCKIsoFields, tck.java.time.temporal.serial.TCKJulianFieldsSerialization, tck.java.time.temporal.serial.TCKValueRangeSerialization, tck.java.time.temporal.serial.TCKWeekFieldsSerialization, tck.java.time.temporal.serial.TCKChronoUnitSerialization, tck.java.time.temporal.serial.TCKChronoFieldSerialization, tck.java.time.TCKDayOfWeek, tck.java.time.TCKOffsetTime, tck.java.time.TCKZonedDateTime, tck.java.time.chrono.TCKJapaneseChronology, tck.java.time.chrono.TCKTestServiceLoader, tck.java.time.chrono.CopticDate, tck.java.time.chrono.TCKThaiBuddhistChronology, tck.java.time.chrono.TCKChronoLocalDateTime, tck.java.time.chrono.TCKMinguoEra, tck.java.time.chrono.TCKChronoZonedDateTime, tck.java.time.chrono.TCKJapaneseEra, tck.java.time.chrono.TCKHijrahChronology, tck.java.time.chrono.TCKHijrahEra, tck.java.time.chrono.TCKChronology, tck.java.time.chrono.TCKIsoEra, tck.java.time.chrono.CopticChronology, tck.java.time.chrono.TCKChronoLocalDate, tck.java.time.chrono.TCKThaiBuddhistEra, tck.java.time.chrono.TCKIsoChronology, tck.java.time.chrono.TCKMinguoChronology, tck.java.time.chrono.CopticEra, tck.java.time.chrono.TCKChronoPeriod, tck.java.time.chrono.serial.TCKChronoZonedDateTimeSerialization, tck.java.time.chrono.serial.TCKCopticSerialization, tck.java.time.chrono.serial.TCKEraSerialization, tck.java.time.chrono.serial.TCKChronoLocalDateSerialization, tck.java.time.chrono.serial.TCKChronoLocalDateTimeSerialization, tck.java.time.chrono.serial.TCKChronologySerialization, tck.java.time.TCKClock_System, tck.java.time.TCKLocalDateTime, tck.java.time.zone.TCKZoneRulesProvider, tck.java.time.zone.TCKZoneOffsetTransitionRule, tck.java.time.zone.TCKFixedZoneRules, tck.java.time.zone.TCKZoneRules, tck.java.time.zone.serial.TCKZoneRulesSerialization, tck.java.time.zone.serial.TCKZoneOffsetTransitionRuleSerialization, tck.java.time.zone.serial.TCKFixedZoneRulesSerialization, tck.java.time.zone.serial.TCKZoneOffsetTransitionSerialization, tck.java.time.zone.TCKZoneOffsetTransition, tck.java.time.TestIsoChronology, tck.java.time.TCKClock_Offset, tck.java.time.TCKClock, tck.java.time.TCKLocalTime, tck.java.time.TCKMonth, tck.java.time.TCKInstant, tck.java.time.TCKYearMonth, tck.java.time.MockSimplePeriod, tck.java.time.AbstractDateTimeTest, tck.java.time.TCKZoneId, tck.java.time.TCKClock_Tick, tck.java.time.TCKDuration, tck.java.time.format.TCKTextStyle, tck.java.time.format.TCKSignStyle, tck.java.time.format.TCKFormatStyle, tck.java.time.format.TCKOffsetPrinterParser, tck.java.time.format.TCKDTFParsedInstant, tck.java.time.format.TCKDateTimeFormatters, tck.java.time.format.TCKLocalizedPrinterParser, tck.java.time.format.TCKChronoPrinterParser, tck.java.time.format.TCKDecimalStyle, tck.java.time.format.TCKLocalizedOffsetIdPrinterParser, tck.java.time.format.TCKPadPrinterParser, tck.java.time.format.TCKDateTimeFormatter, tck.java.time.format.TCKLocalizedFieldPrinter, tck.java.time.format.TCKDateTimeFormatterBuilder, tck.java.time.format.TCKResolverStyle, tck.java.time.format.TCKLocalizedFieldParser, tck.java.time.format.TCKZoneIdPrinterParser, tck.java.time.format.TCKInstantPrinterParser, tck.java.time.format.TCKDateTimeParseResolver, tck.java.time.format.TCKDateTimeTextPrinting, tck.java.time.TCKClock_Fixed, tck.java.time.TCKYear, tck.java.time.TCKZoneOffset, tck.java.time.TCKLocalDate, tck.java.time.AbstractTCKTest, tck.java.time.serial.TCKLocalDateTimeSerialization, tck.java.time.serial.TCKDurationSerialization, tck.java.time.serial.TCKPeriodSerialization, tck.java.time.serial.TCKYearSerialization, tck.java.time.serial.TCKZoneOffsetSerialization, tck.java.time.serial.TCKZonedDateTimeSerialization, tck.java.time.serial.TCKOffsetDateTimeSerialization, tck.java.time.serial.TCKClockSerialization, tck.java.time.serial.TCKLocalDateSerialization, tck.java.time.serial.TCKYearMonthSerialization, tck.java.time.serial.TCKZoneIdSerialization, tck.java.time.serial.TCKInstantSerialization, tck.java.time.serial.TCKLocalTimeSerialization, tck.java.time.serial.TCKOffsetTimeSerialization, tck.java.time.serial.TCKMonthDaySerialization, tck.java.time.TCKOffsetDateTime, tck.java.time.TCKPeriod, nontestng.java.time.chrono.Bug8178823
[2024-11-14T12:26:14.498Z] finished: Thu Nov 14 12:26:13 GMT 2024
[2024-11-14T12:26:14.498Z] elapsed time (seconds): 14.319
[2024-11-14T12:26:14.498Z]
[2024-11-14T12:26:14.498Z] ACTION: compile -- Passed. Compilation successful
[2024-11-14T12:26:14.498Z] REASON: .class file out of date or does not exist
[2024-11-14T12:26:14.498Z] TIME: 1.566 seconds
[2024-11-14T12:26:14.498Z] messages:
[2024-11-14T12:26:14.498Z] command: compile -implicit:none /Users/jenkins/workspace/Test_openjdk11_hs_extended.openjdk_x86-64_mac_rerun/aqa-tests/openjdk/openjdk-jdk/test/lib/jdk/test/lib/RandomFactory.java
[2024-11-14T12:26:14.498Z] reason: .class file out of date or does not exist
[2024-11-14T12:26:14.498Z] started: Thu Nov 14 12:25:58 GMT 2024
[2024-11-14T12:26:14.498Z] Additional options from @modules: --add-modules jdk.localedata
[2024-11-14T12:26:14.498Z] Mode: othervm
[2024-11-14T12:26:14.498Z] finished: Thu Nov 14 12:26:00 GMT 2024
[2024-11-14T12:26:14.498Z] elapsed time (seconds): 1.566
[2024-11-14T12:26:14.498Z] configuration:
[2024-11-14T12:26:14.498Z] javac compilation environment
[2024-11-14T12:26:14.498Z] add modules: jdk.localedata
[2024-11-14T12:26:14.498Z] source path: /Users/jenkins/workspace/Test_openjdk11_hs_extended.openjdk_x86-64_mac_rerun/aqa-tests/openjdk/openjdk-jdk/test/lib
[2024-11-14T12:26:14.498Z] class path: /Users/jenkins/workspace/Test_openjdk11_hs_extended.openjdk_x86-64_mac_rerun/aqa-tests/TKG/output_17315871514520/jdk_custom_0/work/classes/0/test/lib
[2024-11-14T12:26:14.498Z] /Users/jenkins/workspace/Test_openjdk11_hs_extended.openjdk_x86-64_mac_rerun/jvmtest/openjdk/jtreg/lib/testng-7.3.0.jar
[2024-11-14T12:26:14.498Z] /Users/jenkins/workspace/Test_openjdk11_hs_extended.openjdk_x86-64_mac_rerun/jvmtest/openjdk/jtreg/lib/guice-5.1.0.jar
[2024-11-14T12:26:14.498Z] /Users/jenkins/workspace/Test_openjdk11_hs_extended.openjdk_x86-64_mac_rerun/jvmtest/openjdk/jtreg/lib/jcommander-1.82.jar
[2024-11-14T12:26:14.498Z]
[2024-11-14T12:26:14.498Z] rerun:
[2024-11-14T12:26:14.498Z] cd /Users/jenkins/workspace/Test_openjdk11_hs_extended.openjdk_x86-64_mac_rerun/aqa-tests/TKG/output_17315871514520/jdk_custom_0/work/java/time/test/java/time/format/TestUTCParse && \
[2024-11-14T12:26:14.498Z] HOME=/Users/jenkins \
[2024-11-14T12:26:14.498Z] PATH=/bin:/usr/bin:/usr/sbin \
[2024-11-14T12:26:14.498Z] /Users/jenkins/workspace/Test_openjdk11_hs_extended.openjdk_x86-64_mac_rerun/jdkbinary/j2sdk-image/Contents/Home/bin/../bin/javac \
[2024-11-14T12:26:14.498Z] -J-ea \
[2024-11-14T12:26:14.498Z] -J-esa \
[2024-11-14T12:26:14.498Z] -J-Xmx512m \
[2024-11-14T12:26:14.498Z] -J-Dtest.vm.opts='-ea -esa -Xmx512m' \
[2024-11-14T12:26:14.498Z] -J-Dtest.tool.vm.opts='-J-ea -J-esa -J-Xmx512m' \
[2024-11-14T12:26:14.498Z] -J-Dtest.compiler.opts= \
[2024-11-14T12:26:14.498Z] -J-Dtest.java.opts= \
[2024-11-14T12:26:14.498Z] -J-Dtest.jdk=/Users/jenkins/workspace/Test_openjdk11_hs_extended.openjdk_x86-64_mac_rerun/jdkbinary/j2sdk-image/Contents/Home/bin/.. \
[2024-11-14T12:26:14.498Z] -J-Dcompile.jdk=/Users/jenkins/workspace/Test_openjdk11_hs_extended.openjdk_x86-64_mac_rerun/jdkbinary/j2sdk-image/Contents/Home/bin/.. \
[2024-11-14T12:26:14.498Z] -J-Dtest.timeout.factor=8.0 \
[2024-11-14T12:26:14.498Z] -J-Dtest.nativepath=/Users/jenkins/workspace/Test_openjdk11_hs_extended.openjdk_x86-64_mac_rerun/jdkbinary/openjdk-test-image/jdk/jtreg/native \
[2024-11-14T12:26:14.498Z] -J-Dtest.root=/Users/jenkins/workspace/Test_openjdk11_hs_extended.openjdk_x86-64_mac_rerun/aqa-tests/openjdk/openjdk-jdk/test/jdk \
[2024-11-14T12:26:14.498Z] -J-Dtest.name=java/time/test/java/time/format/TestUTCParse.java \
[2024-11-14T12:26:14.499Z] -J-Dtest.file=/Users/jenkins/workspace/Test_openjdk11_hs_extended.openjdk_x86-64_mac_rerun/aqa-tests/openjdk/openjdk-jdk/test/jdk/java/time/test/java/time/format/TestUTCParse.java \
[2024-11-14T12:26:14.499Z] -J-Dtest.src=/Users/jenkins/workspace/Test_openjdk11_hs_extended.openjdk_x86-64_mac_rerun/aqa-tests/openjdk/openjdk-jdk/test/jdk/java/time \
[2024-11-14T12:26:14.499Z] -J-Dtest.src.path=/Users/jenkins/workspace/Test_openjdk11_hs_extended.openjdk_x86-64_mac_rerun/aqa-tests/openjdk/openjdk-jdk/test/jdk/java/time:/Users/jenkins/workspace/Test_openjdk11_hs_extended.openjdk_x86-64_mac_rerun/aqa-tests/openjdk/openjdk-jdk/test/lib \
[2024-11-14T12:26:14.499Z] -J-Dtest.classes=/Users/jenkins/workspace/Test_openjdk11_hs_extended.openjdk_x86-64_mac_rerun/aqa-tests/TKG/output_17315871514520/jdk_custom_0/work/classes/0/java/time \
[2024-11-14T12:26:14.499Z] -J-Dtest.class.path=/Users/jenkins/workspace/Test_openjdk11_hs_extended.openjdk_x86-64_mac_rerun/aqa-tests/TKG/output_17315871514520/jdk_custom_0/work/classes/0/java/time:/Users/jenkins/workspace/Test_openjdk11_hs_extended.openjdk_x86-64_mac_rerun/aqa-tests/TKG/output_17315871514520/jdk_custom_0/work/classes/0/test/lib \
[2024-11-14T12:26:14.499Z] -J-Dtest.modules=jdk.localedata \
[2024-11-14T12:26:14.499Z] @/Users/jenkins/workspace/Test_openjdk11_hs_extended.openjdk_x86-64_mac_rerun/aqa-tests/TKG/output_17315871514520/jdk_custom_0/work/java/time/test/java/time/format/TestUTCParse.d/compile.0.jta
[2024-11-14T12:26:14.499Z] STDOUT:
[2024-11-14T12:26:14.499Z] STDERR:
[2024-11-14T12:26:14.499Z]
[2024-11-14T12:26:14.499Z] ACTION: compile -- Passed. Compilation successful
[2024-11-14T12:26:14.499Z] REASON: .class file out of date or does not exist
[2024-11-14T12:26:14.499Z] TIME: 12.725 seconds
[2024-11-14T12:26:14.499Z] messages:
[2024-11-14T12:26:14.500Z] command: compile -implicit:none /Users/jenkins/workspace/Test_openjdk11_hs_extended.openjdk_x86-64_mac_rerun/aqa-tests/openjdk/openjdk-jdk/test/jdk/java/time/test/java/util/TestFormatter.java /Users/jenkins/workspace/Test_openjdk11_hs_extended.openjdk_x86-64_mac_rerun/aqa-tests/openjdk/openjdk-jdk/test/jdk/java/time/test/java/time/TestOffsetDateTime.java /Users/jenkins/workspace/Test_openjdk11_hs_extended.openjdk_x86-64_mac_rerun/aqa-tests/openjdk/openjdk-jdk/test/jdk/java/time/test/java/time/temporal/TestChronoUnit.java /Users/jenkins/workspace/Test_openjdk11_hs_extended.openjdk_x86-64_mac_rerun/aqa-tests/openjdk/openjdk-jdk/test/jdk/java/time/test/java/time/temporal/MockFieldValue.java /Users/jenkins/workspace/Test_openjdk11_hs_extended.openjdk_x86-64_mac_rerun/aqa-tests/openjdk/openjdk-jdk/test/jdk/java/time/test/java/time/temporal/TestJulianFields.java /Users/jenkins/workspace/Test_openjdk11_hs_extended.openjdk_x86-64_mac_rerun/aqa-tests/openjdk/openjdk-jdk/test/jdk/java/time/test/java/time/temporal/TestDateTimeBuilderCombinations.java /Users/jenkins/workspace/Test_openjdk11_hs_extended.openjdk_x86-64_mac_rerun/aqa-tests/openjdk/openjdk-jdk/test/jdk/java/time/test/java/time/temporal/TestChronoField.java /Users/jenkins/workspace/Test_openjdk11_hs_extended.openjdk_x86-64_mac_rerun/aqa-tests/openjdk/openjdk-jdk/test/jdk/java/time/test/java/time/temporal/MockFieldNoValue.java /Users/jenkins/workspace/Test_openjdk11_hs_extended.openjdk_x86-64_mac_rerun/aqa-tests/openjdk/openjdk-jdk/test/jdk/java/time/test/java/time/temporal/TestDateTimeValueRange.java /Users/jenkins/workspace/Test_openjdk11_hs_extended.openjdk_x86-64_mac_rerun/aqa-tests/openjdk/openjdk-jdk/test/jdk/java/time/test/java/time/temporal/TestIsoWeekFields.java /Users/jenkins/workspace/Test_openjdk11_hs_extended.openjdk_x86-64_mac_rerun/aqa-tests/openjdk/openjdk-jdk/test/jdk/java/time/test/java/time/TestClock_System.java /Users/jenkins/workspace/Test_openjdk11_hs_extended.openjdk_x86-64_mac_rerun/aqa-tests/openjdk/openjdk-jdk/test/jdk/java/time/test/java/time/TestClock_Fixed.java /Users/jenkins/workspace/Test_openjdk11_hs_extended.openjdk_x86-64_mac_rerun/aqa-tests/openjdk/openjdk-jdk/test/jdk/java/time/test/java/time/chrono/TestServiceLoader.java /Users/jenkins/workspace/Test_openjdk11_hs_extended.openjdk_x86-64_mac_rerun/aqa-tests/openjdk/openjdk-jdk/test/jdk/java/time/test/java/time/chrono/TestEraDisplayName.java /Users/jenkins/workspace/Test_openjdk11_hs_extended.openjdk_x86-64_mac_rerun/aqa-tests/openjdk/openjdk-jdk/test/jdk/java/time/test/java/time/chrono/TestUmmAlQuraChronology.java /Users/jenkins/workspace/Test_openjdk11_hs_extended.openjdk_x86-64_mac_rerun/aqa-tests/openjdk/openjdk-jdk/test/jdk/java/time/test/java/time/chrono/TestThaiBuddhistChronoImpl.java /Users/jenkins/workspace/Test_openjdk11_hs_extended.openjdk_x86-64_mac_rerun/aqa-tests/openjdk/openjdk-jdk/test/jdk/java/time/test/java/time/chrono/TestExampleCode.java /Users/jenkins/workspace/Test_openjdk11_hs_extended.openjdk_x86-64_mac_rerun/aqa-tests/openjdk/openjdk-jdk/test/jdk/java/time/test/java/time/chrono/TestIsoChronoImpl.java /Users/jenkins/workspace/Test_openjdk11_hs_extended.openjdk_x86-64_mac_rerun/aqa-tests/openjdk/openjdk-jdk/test/jdk/java/time/test/java/time/chrono/TestChronoLocalDate.java /Users/jenkins/workspace/Test_openjdk11_hs_extended.openjdk_x86-64_mac_rerun/aqa-tests/openjdk/openjdk-jdk/test/jdk/java/time/test/java/time/chrono/TestChronologyPerf.java /Users/jenkins/workspace/Test_openjdk11_hs_extended.openjdk_x86-64_mac_rerun/aqa-tests/openjdk/openjdk-jdk/test/jdk/java/time/test/java/time/chrono/TestJapaneseChronology.java /Users/jenkins/workspace/Test_openjdk11_hs_extended.openjdk_x86-64_mac_rerun/aqa-tests/openjdk/openjdk-jdk/test/jdk/java/time/test/java/time/chrono/TestJapaneseChronoImpl.java /Users/jenkins/workspace/Test_openjdk11_hs_extended.openjdk_x86-64_mac_rerun/aqa-tests/openjdk/openjdk-jdk/test/jdk/java/time/test/java/time/TestInstant.java /Users/jenkins/workspace/Test_openjdk11_hs_extended.openjdk_x86-64_mac_rerun/aqa-tests/openjdk/openjdk-jdk/test/jdk/java/time/test/java/time/TestOffsetTime.java /Users/jenkins/workspace/Test_openjdk11_hs_extended.openjdk_x86-64_mac_rerun/aqa-tests/openjdk/openjdk-jdk/test/jdk/java/time/test/java/time/zone/TestZoneRules.java /Users/jenkins/workspace/Test_openjdk11_hs_extended.openjdk_x86-64_mac_rerun/aqa-tests/openjdk/openjdk-jdk/test/jdk/java/time/test/java/time/zone/TestFixedZoneRules.java /Users/jenkins/workspace/Test_openjdk11_hs_extended.openjdk_x86-64_mac_rerun/aqa-tests/openjdk/openjdk-jdk/test/jdk/java/time/test/java/time/TestLocalDate.java /Users/jenkins/workspace/Test_openjdk11_hs_extended.openjdk_x86-64_mac_rerun/aqa-tests/openjdk/openjdk-jdk/test/jdk/java/time/test/java/time/TestYear.java /Users/jenkins/workspace/Test_openjdk11_hs_extended.openjdk_x86-64_mac_rerun/aqa-tests/openjdk/openjdk-jdk/test/jdk/java/time/test/java/time/TestMonthDay.java /Users/jenkins/workspace/Test_openjdk11_hs_extended.openjdk_x86-64_mac_rerun/aqa-tests/openjdk/openjdk-jdk/test/jdk/java/time/test/java/time/TestClock_Offset.java /Users/jenkins/workspace/Test_openjdk11_hs_extended.openjdk_x86-64_mac_rerun/aqa-tests/openjdk/openjdk-jdk/test/jdk/java/time/test/java/time/MockSimplePeriod.java /Users/jenkins/workspace/Test_openjdk11_hs_extended.openjdk_x86-64_mac_rerun/aqa-tests/openjdk/openjdk-jdk/test/jdk/java/time/test/java/time/TestZoneId.java /Users/jenkins/workspace/Test_openjdk11_hs_extended.openjdk_x86-64_mac_rerun/aqa-tests/openjdk/openjdk-jdk/test/jdk/java/time/test/java/time/TestLocalDateTime.java /Users/jenkins/workspace/Test_openjdk11_hs_extended.openjdk_x86-64_mac_rerun/aqa-tests/openjdk/openjdk-jdk/test/jdk/java/time/test/java/time/TestOffsetDateTime_instants.java /Users/jenkins/workspace/Test_openjdk11_hs_extended.openjdk_x86-64_mac_rerun/aqa-tests/openjdk/openjdk-jdk/test/jdk/java/time/test/java/time/TestZoneOffset.java /Users/jenkins/workspace/Test_openjdk11_hs_extended.openjdk_x86-64_mac_rerun/aqa-tests/openjdk/openjdk-jdk/test/jdk/java/time/test/java/time/format/TestReducedParser.java /Users/jenkins/workspace/Test_openjdk11_hs_extended.openjdk_x86-64_mac_rerun/aqa-tests/openjdk/openjdk-jdk/test/jdk/java/time/test/java/time/format/TestStringLiteralParser.java /Users/jenkins/workspace/Test_openjdk11_hs_extended.openjdk_x86-64_mac_rerun/aqa-tests/openjdk/openjdk-jdk/test/jdk/java/time/test/java/time/format/TestCharLiteralParser.java /Users/jenkins/workspace/Test_openjdk11_hs_extended.openjdk_x86-64_mac_rerun/aqa-tests/openjdk/openjdk-jdk/test/jdk/java/time/test/java/time/format/AbstractTestPrinterParser.java /Users/jenkins/workspace/Test_openjdk11_hs_extended.openjdk_x86-64_mac_rerun/aqa-tests/openjdk/openjdk-jdk/test/jdk/java/time/test/java/time/format/TestNumberParser.java /Users/jenkins/workspace/Test_openjdk11_hs_extended.openjdk_x86-64_mac_rerun/aqa-tests/openjdk/openjdk-jdk/test/jdk/java/time/test/java/time/format/TestZoneOffsetParser.java /Users/jenkins/workspace/Test_openjdk11_hs_extended.openjdk_x86-64_mac_rerun/aqa-tests/openjdk/openjdk-jdk/test/jdk/java/time/test/java/time/format/TestDateTimeParsing.java /Users/jenkins/workspace/Test_openjdk11_hs_extended.openjdk_x86-64_mac_rerun/aqa-tests/openjdk/openjdk-jdk/test/jdk/java/time/test/java/time/format/TestCharLiteralPrinter.java /Users/jenkins/workspace/Test_openjdk11_hs_extended.openjdk_x86-64_mac_rerun/aqa-tests/openjdk/openjdk-jdk/test/jdk/java/time/test/java/time/format/TestDateTimeTextProviderWithLocale.java /Users/jenkins/workspace/Test_openjdk11_hs_extended.openjdk_x86-64_mac_rerun/aqa-tests/openjdk/openjdk-jdk/test/jdk/java/time/test/java/time/format/TestReducedPrinter.java /Users/jenkins/workspace/Test_openjdk11_hs_extended.openjdk_x86-64_mac_rerun/aqa-tests/openjdk/openjdk-jdk/test/jdk/java/time/test/java/time/format/TestUTCParse.java /Users/jenkins/workspace/Test_openjdk11_hs_extended.openjdk_x86-64_mac_rerun/aqa-tests/openjdk/openjdk-jdk/test/jdk/java/time/test/java/time/format/TestPadPrinterDecorator.java /Users/jenkins/workspace/Test_openjdk11_hs_extended.openjdk_x86-64_mac_rerun/aqa-tests/openjdk/openjdk-jdk/test/jdk/java/time/test/java/time/format/TestDateTimeTextProvider.java /Users/jenkins/workspace/Test_openjdk11_hs_extended.openjdk_x86-64_mac_rerun/aqa-tests/openjdk/openjdk-jdk/test/jdk/java/time/test/java/time/format/TestDateTimeFormatterBuilder.java /Users/jenkins/workspace/Test_openjdk11_hs_extended.openjdk_x86-64_mac_rerun/aqa-tests/openjdk/openjdk-jdk/test/jdk/java/time/test/java/time/format/TestDateTimeFormatter.java /Users/jenkins/workspace/Test_openjdk11_hs_extended.openjdk_x86-64_mac_rerun/aqa-tests/openjdk/openjdk-jdk/test/jdk/java/time/test/java/time/format/TestNarrowMonthNamesAndDayNames.java /Users/jenkins/workspace/Test_openjdk11_hs_extended.openjdk_x86-64_mac_rerun/aqa-tests/openjdk/openjdk-jdk/test/jdk/java/time/test/java/time/format/TestTextParser.java /Users/jenkins/workspace/Test_openjdk11_hs_extended.openjdk_x86-64_mac_rerun/aqa-tests/openjdk/openjdk-jdk/test/jdk/java/time/test/java/time/format/TestDecimalStyle.java /Users/jenkins/workspace/Test_openjdk11_hs_extended.openjdk_x86-64_mac_rerun/aqa-tests/openjdk/openjdk-jdk/test/jdk/java/time/test/java/time/format/TestStringLiteralPrinter.java /Users/jenkins/workspace/Test_openjdk11_hs_extended.openjdk_x86-64_mac_rerun/aqa-tests/openjdk/openjdk-jdk/test/jdk/java/time/test/java/time/format/TestTextParserWithLocale.java /Users/jenkins/workspace/Test_openjdk11_hs_extended.openjdk_x86-64_mac_rerun/aqa-tests/openjdk/openjdk-jdk/test/jdk/java/time/test/java/time/format/TestTextPrinter.java /Users/jenkins/workspace/Test_openjdk11_hs_extended.openjdk_x86-64_mac_rerun/aqa-tests/openjdk/openjdk-jdk/test/jdk/java/time/test/java/time/format/MockIOExceptionAppendable.java /Users/jenkins/workspace/Test_openjdk11_hs_extended.openjdk_x86-64_mac_rerun/aqa-tests/openjdk/openjdk-jdk/test/jdk/java/time/test/java/time/format/TestSettingsParser.java /Users/jenkins/workspace/Test_openjdk11_hs_extended.openjdk_x86-64_mac_rerun/aqa-tests/openjdk/openjdk-jdk/test/jdk/java/time/test/java/time/format/TestUnicodeExtension.java /Users/jenkins/workspace/Test_openjdk11_hs_extended.openjdk_x86-64_mac_rerun/aqa-tests/openjdk/openjdk-jdk/test/jdk/java/time/test/java/time/format/TestFractionPrinterParser.java /Users/jenkins/workspace/Test_openjdk11_hs_extended.openjdk_x86-64_mac_rerun/aqa-tests/openjdk/openjdk-jdk/test/jdk/java/time/test/java/time/format/ZoneName.java /Users/jenkins/workspace/Test_openjdk11_hs_extended.openjdk_x86-64_mac_rerun/aqa-tests/openjdk/openjdk-jdk/test/jdk/java/time/test/java/time/format/TestNumberPrinter.java /Users/jenkins/workspace/Test_openjdk11_hs_extended.openjdk_x86-64_mac_rerun/aqa-tests/openjdk/openjdk-jdk/test/jdk/java/time/test/java/time/format/TestZoneTextPrinterParser.java /Users/jenkins/workspace/Test_openjdk11_hs_extended.openjdk_x86-64_mac_rerun/aqa-tests/openjdk/openjdk-jdk/test/jdk/java/time/test/java/time/format/TestNonIsoFormatter.java /Users/jenkins/workspace/Test_openjdk11_hs_extended.openjdk_x86-64_mac_rerun/aqa-tests/openjdk/openjdk-jdk/test/jdk/java/time/test/java/time/format/TestDateTimeFormatterBuilderWithLocale.java /Users/jenkins/workspace/Test_openjdk11_hs_extended.openjdk_x86-64_mac_rerun/aqa-tests/openjdk/openjdk-jdk/test/jdk/java/time/test/java/time/format/TestZoneOffsetPrinter.java /Users/jenkins/workspace/Test_openjdk11_hs_extended.openjdk_x86-64_mac_rerun/aqa-tests/openjdk/openjdk-jdk/test/jdk/java/time/test/java/time/format/TestTextPrinterWithLocale.java /Users/jenkins/workspace/Test_openjdk11_hs_extended.openjdk_x86-64_mac_rerun/aqa-tests/openjdk/openjdk-jdk/test/jdk/java/time/test/java/time/AbstractTest.java /Users/jenkins/workspace/Test_openjdk11_hs_extended.openjdk_x86-64_mac_rerun/aqa-tests/openjdk/openjdk-jdk/test/jdk/java/time/test/java/time/TestDuration.java /Users/jenkins/workspace/Test_openjdk11_hs_extended.openjdk_x86-64_mac_rerun/aqa-tests/openjdk/openjdk-jdk/test/jdk/java/time/test/java/time/TestYearMonth.java /Users/jenkins/workspace/Test_openjdk11_hs_extended.openjdk_x86-64_mac_rerun/aqa-tests/openjdk/openjdk-jdk/test/jdk/java/time/test/java/time/TestZonedDateTime.java /Users/jenkins/workspace/Test_openjdk11_hs_extended.openjdk_x86-64_mac_rerun/aqa-tests/openjdk/openjdk-jdk/test/jdk/java/time/test/java/time/TestClock_Tick.java /Users/jenkins/workspace/Test_openjdk11_hs_extended.openjdk_x86-64_mac_rerun/aqa-tests/openjdk/openjdk-jdk/test/jdk/java/time/test/java/time/TestLocalTime.java /Users/jenkins/workspace/Test_openjdk11_hs_extended.openjdk_x86-64_mac_rerun/aqa-tests/openjdk/openjdk-jdk/test/jdk/java/time/test/java/time/TestPeriod.java /Users/jenkins/workspace/Test_openjdk11_hs_extended.openjdk_x86-64_mac_rerun/aqa-tests/openjdk/openjdk-jdk/test/jdk/java/time/tck/java/time/TCKMonthDay.java /Users/jenkins/workspace/Test_openjdk11_hs_extended.openjdk_x86-64_mac_rerun/aqa-tests/openjdk/openjdk-jdk/test/jdk/java/time/tck/java/time/temporal/TCKWeekFields.java /Users/jenkins/workspace/Test_openjdk11_hs_extended.openjdk_x86-64_mac_rerun/aqa-tests/openjdk/openjdk-jdk/test/jdk/java/time/tck/java/time/temporal/TCKChronoUnit.java /Users/jenkins/workspace/Test_openjdk11_hs_extended.openjdk_x86-64_mac_rerun/aqa-tests/openjdk/openjdk-jdk/test/jdk/java/time/tck/java/time/temporal/TCKJulianFields.java /Users/jenkins/workspace/Test_openjdk11_hs_extended.openjdk_x86-64_mac_rerun/aqa-tests/openjdk/openjdk-jdk/test/jdk/java/time/tck/java/time/temporal/TCKTemporalAdjusters.java /Users/jenkins/workspace/Test_openjdk11_hs_extended.openjdk_x86-64_mac_rerun/aqa-tests/openjdk/openjdk-jdk/test/jdk/java/time/tck/java/time/temporal/TCKChronoField.java /Users/jenkins/workspace/Test_openjdk11_hs_extended.openjdk_x86-64_mac_rerun/aqa-tests/openjdk/openjdk-jdk/test/jdk/java/time/tck/java/time/temporal/TCKIsoFields.java /Users/jenkins/workspace/Test_openjdk11_hs_extended.openjdk_x86-64_mac_rerun/aqa-tests/openjdk/openjdk-jdk/test/jdk/java/time/tck/java/time/temporal/serial/TCKJulianFieldsSerialization.java /Users/jenkins/workspace/Test_openjdk11_hs_extended.openjdk_x86-64_mac_rerun/aqa-tests/openjdk/openjdk-jdk/test/jdk/java/time/tck/java/time/temporal/serial/TCKValueRangeSerialization.java /Users/jenkins/workspace/Test_openjdk11_hs_extended.openjdk_x86-64_mac_rerun/aqa-tests/openjdk/openjdk-jdk/test/jdk/java/time/tck/java/time/temporal/serial/TCKWeekFieldsSerialization.java /Users/jenkins/workspace/Test_openjdk11_hs_extended.openjdk_x86-64_mac_rerun/aqa-tests/openjdk/openjdk-jdk/test/jdk/java/time/tck/java/time/temporal/serial/TCKChronoUnitSerialization.java /Users/jenkins/workspace/Test_openjdk11_hs_extended.openjdk_x86-64_mac_rerun/aqa-tests/openjdk/openjdk-jdk/test/jdk/java/time/tck/java/time/temporal/serial/TCKChronoFieldSerialization.java /Users/jenkins/workspace/Test_openjdk11_hs_extended.openjdk_x86-64_mac_rerun/aqa-tests/openjdk/openjdk-jdk/test/jdk/java/time/tck/java/time/TCKDayOfWeek.java /Users/jenkins/workspace/Test_openjdk11_hs_extended.openjdk_x86-64_mac_rerun/aqa-tests/openjdk/openjdk-jdk/test/jdk/java/time/tck/java/time/TCKOffsetTime.java /Users/jenkins/workspace/Test_openjdk11_hs_extended.openjdk_x86-64_mac_rerun/aqa-tests/openjdk/openjdk-jdk/test/jdk/java/time/tck/java/time/TCKZonedDateTime.java /Users/jenkins/workspace/Test_openjdk11_hs_extended.openjdk_x86-64_mac_rerun/aqa-tests/openjdk/openjdk-jdk/test/jdk/java/time/tck/java/time/chrono/TCKJapaneseChronology.java /Users/jenkins/workspace/Test_openjdk11_hs_extended.openjdk_x86-64_mac_rerun/aqa-tests/openjdk/openjdk-jdk/test/jdk/java/time/tck/java/time/chrono/TCKTestServiceLoader.java /Users/jenkins/workspace/Test_openjdk11_hs_extended.openjdk_x86-64_mac_rerun/aqa-tests/openjdk/openjdk-jdk/test/jdk/java/time/tck/java/time/chrono/CopticDate.java /Users/jenkins/workspace/Test_openjdk11_hs_extended.openjdk_x86-64_mac_rerun/aqa-tests/openjdk/openjdk-jdk/test/jdk/java/time/tck/java/time/chrono/TCKThaiBuddhistChronology.java /Users/jenkins/workspace/Test_openjdk11_hs_extended.openjdk_x86-64_mac_rerun/aqa-tests/openjdk/openjdk-jdk/test/jdk/java/time/tck/java/time/chrono/TCKChronoLocalDateTime.java /Users/jenkins/workspace/Test_openjdk11_hs_extended.openjdk_x86-64_mac_rerun/aqa-tests/openjdk/openjdk-jdk/test/jdk/java/time/tck/java/time/chrono/TCKMinguoEra.java /Users/jenkins/workspace/Test_openjdk11_hs_extended.openjdk_x86-64_mac_rerun/aqa-tests/openjdk/openjdk-jdk/test/jdk/java/time/tck/java/time/chrono/TCKChronoZonedDateTime.java /Users/jenkins/workspace/Test_openjdk11_hs_extended.openjdk_x86-64_mac_rerun/aqa-tests/openjdk/openjdk-jdk/test/jdk/java/time/tck/java/time/chrono/TCKJapaneseEra.java /Users/jenkins/workspace/Test_openjdk11_hs_extended.openjdk_x86-64_mac_rerun/aqa-tests/openjdk/openjdk-jdk/test/jdk/java/time/tck/java/time/chrono/TCKHijrahChronology.java /Users/jenkins/workspace/Test_openjdk11_hs_extended.openjdk_x86-64_mac_rerun/aqa-tests/openjdk/openjdk-jdk/test/jdk/java/time/tck/java/time/chrono/TCKHijrahEra.java /Users/jenkins/workspace/Test_openjdk11_hs_extended.openjdk_x86-64_mac_rerun/aqa-tests/openjdk/openjdk-jdk/test/jdk/java/time/tck/java/time/chrono/TCKChronology.java /Users/jenkins/workspace/Test_openjdk11_hs_extended.openjdk_x86-64_mac_rerun/aqa-tests/openjdk/openjdk-jdk/test/jdk/java/time/tck/java/time/chrono/TCKIsoEra.java /Users/jenkins/workspace/Test_openjdk11_hs_extended.openjdk_x86-64_mac_rerun/aqa-tests/openjdk/openjdk-jdk/test/jdk/java/time/tck/java/time/chrono/CopticChronology.java /Users/jenkins/workspace/Test_openjdk11_hs_extended.openjdk_x86-64_mac_rerun/aqa-tests/openjdk/openjdk-jdk/test/jdk/java/time/tck/java/time/chrono/TCKChronoLocalDate.java /Users/jenkins/workspace/Test_openjdk11_hs_extended.openjdk_x86-64_mac_rerun/aqa-tests/openjdk/openjdk-jdk/test/jdk/java/time/tck/java/time/chrono/TCKThaiBuddhistEra.java /Users/jenkins/workspace/Test_openjdk11_hs_extended.openjdk_x86-64_mac_rerun/aqa-tests/openjdk/openjdk-jdk/test/jdk/java/time/tck/java/time/chrono/TCKIsoChronology.java /Users/jenkins/workspace/Test_openjdk11_hs_extended.openjdk_x86-64_mac_rerun/aqa-tests/openjdk/openjdk-jdk/test/jdk/java/time/tck/java/time/chrono/TCKMinguoChronology.java /Users/jenkins/workspace/Test_openjdk11_hs_extended.openjdk_x86-64_mac_rerun/aqa-tests/openjdk/openjdk-jdk/test/jdk/java/time/tck/java/time/chrono/CopticEra.java /Users/jenkins/workspace/Test_openjdk11_hs_extended.openjdk_x86-64_mac_rerun/aqa-tests/openjdk/openjdk-jdk/test/jdk/java/time/tck/java/time/chrono/TCKChronoPeriod.java /Users/jenkins/workspace/Test_openjdk11_hs_extended.openjdk_x86-64_mac_rerun/aqa-tests/openjdk/openjdk-jdk/test/jdk/java/time/tck/java/time/chrono/serial/TCKChronoZonedDateTimeSerialization.java /Users/jenkins/workspace/Test_openjdk11_hs_extended.openjdk_x86-64_mac_rerun/aqa-tests/openjdk/openjdk-jdk/test/jdk/java/time/tck/java/time/chrono/serial/TCKCopticSerialization.java /Users/jenkins/workspace/Test_openjdk11_hs_extended.openjdk_x86-64_mac_rerun/aqa-tests/openjdk/openjdk-jdk/test/jdk/java/time/tck/java/time/chrono/serial/TCKEraSerialization.java /Users/jenkins/workspace/Test_openjdk11_hs_extended.openjdk_x86-64_mac_rerun/aqa-tests/openjdk/openjdk-jdk/test/jdk/java/time/tck/java/time/chrono/serial/TCKChronoLocalDateSerialization.java /Users/jenkins/workspace/Test_openjdk11_hs_extended.openjdk_x86-64_mac_rerun/aqa-tests/openjdk/openjdk-jdk/test/jdk/java/time/tck/java/time/chrono/serial/TCKChronoLocalDateTimeSerialization.java /Users/jenkins/workspace/Test_openjdk11_hs_extended.openjdk_x86-64_mac_rerun/aqa-tests/openjdk/openjdk-jdk/test/jdk/java/time/tck/java/time/chrono/serial/TCKChronologySerialization.java /Users/jenkins/workspace/Test_openjdk11_hs_extended.openjdk_x86-64_mac_rerun/aqa-tests/openjdk/openjdk-jdk/test/jdk/java/time/tck/java/time/TCKClock_System.java /Users/jenkins/workspace/Test_openjdk11_hs_extended.openjdk_x86-64_mac_rerun/aqa-tests/openjdk/openjdk-jdk/test/jdk/java/time/tck/java/time/TCKLocalDateTime.java /Users/jenkins/workspace/Test_openjdk11_hs_extended.openjdk_x86-64_mac_rerun/aqa-tests/openjdk/openjdk-jdk/test/jdk/java/time/tck/java/time/zone/TCKZoneRulesProvider.java /Users/jenkins/workspace/Test_openjdk11_hs_extended.openjdk_x86-64_mac_rerun/aqa-tests/openjdk/openjdk-jdk/test/jdk/java/time/tck/java/time/zone/TCKZoneOffsetTransitionRule.java /Users/jenkins/workspace/Test_openjdk11_hs_extended.openjdk_x86-64_mac_rerun/aqa-tests/openjdk/openjdk-jdk/test/jdk/java/time/tck/java/time/zone/TCKFixedZoneRules.java /Users/jenkins/workspace/Test_openjdk11_hs_extended.openjdk_x86-64_mac_rerun/aqa-tests/openjdk/openjdk-jdk/test/jdk/java/time/tck/java/time/zone/TCKZoneRules.java /Users/jenkins/workspace/Test_openjdk11_hs_extended.openjdk_x86-64_mac_rerun/aqa-tests/openjdk/openjdk-jdk/test/jdk/java/time/tck/java/time/zone/serial/TCKZoneRulesSerialization.java /Users/jenkins/workspace/Test_openjdk11_hs_extended.openjdk_x86-64_mac_rerun/aqa-tests/openjdk/openjdk-jdk/test/jdk/java/time/tck/java/time/zone/serial/TCKZoneOffsetTransitionRuleSerialization.java /Users/jenkins/workspace/Test_openjdk11_hs_extended.openjdk_x86-64_mac_rerun/aqa-tests/openjdk/openjdk-jdk/test/jdk/java/time/tck/java/time/zone/serial/TCKFixedZoneRulesSerialization.java /Users/jenkins/workspace/Test_openjdk11_hs_extended.openjdk_x86-64_mac_rerun/aqa-tests/openjdk/openjdk-jdk/test/jdk/java/time/tck/java/time/zone/serial/TCKZoneOffsetTransitionSerialization.java /Users/jenkins/workspace/Test_openjdk11_hs_extended.openjdk_x86-64_mac_rerun/aqa-tests/openjdk/openjdk-jdk/test/jdk/java/time/tck/java/time/zone/TCKZoneOffsetTransition.java /Users/jenkins/workspace/Test_openjdk11_hs_extended.openjdk_x86-64_mac_rerun/aqa-tests/openjdk/openjdk-jdk/test/jdk/java/time/tck/java/time/TestIsoChronology.java /Users/jenkins/workspace/Test_openjdk11_hs_extended.openjdk_x86-64_mac_rerun/aqa-tests/openjdk/openjdk-jdk/test/jdk/java/time/tck/java/time/TCKClock_Offset.java /Users/jenkins/workspace/Test_openjdk11_hs_extended.openjdk_x86-64_mac_rerun/aqa-tests/openjdk/openjdk-jdk/test/jdk/java/time/tck/java/time/TCKClock.java /Users/jenkins/workspace/Test_openjdk11_hs_extended.openjdk_x86-64_mac_rerun/aqa-tests/openjdk/openjdk-jdk/test/jdk/java/time/tck/java/time/TCKLocalTime.java /Users/jenkins/workspace/Test_openjdk11_hs_extended.openjdk_x86-64_mac_rerun/aqa-tests/openjdk/openjdk-jdk/test/jdk/java/time/tck/java/time/TCKMonth.java /Users/jenkins/workspace/Test_openjdk11_hs_extended.openjdk_x86-64_mac_rerun/aqa-tests/openjdk/openjdk-jdk/test/jdk/java/time/tck/java/time/TCKInstant.java /Users/jenkins/workspace/Test_openjdk11_hs_extended.openjdk_x86-64_mac_rerun/aqa-tests/openjdk/openjdk-jdk/test/jdk/java/time/tck/java/time/TCKYearMonth.java /Users/jenkins/workspace/Test_openjdk11_hs_extended.openjdk_x86-64_mac_rerun/aqa-tests/openjdk/openjdk-jdk/test/jdk/java/time/tck/java/time/MockSimplePeriod.java /Users/jenkins/workspace/Test_openjdk11_hs_extended.openjdk_x86-64_mac_rerun/aqa-tests/openjdk/openjdk-jdk/test/jdk/java/time/tck/java/time/AbstractDateTimeTest.java /Users/jenkins/workspace/Test_openjdk11_hs_extended.openjdk_x86-64_mac_rerun/aqa-tests/openjdk/openjdk-jdk/test/jdk/java/time/tck/java/time/TCKZoneId.java /Users/jenkins/workspace/Test_openjdk11_hs_extended.openjdk_x86-64_mac_rerun/aqa-tests/openjdk/openjdk-jdk/test/jdk/java/time/tck/java/time/TCKClock_Tick.java /Users/jenkins/workspace/Test_openjdk11_hs_extended.openjdk_x86-64_mac_rerun/aqa-tests/openjdk/openjdk-jdk/test/jdk/java/time/tck/java/time/TCKDuration.java /Users/jenkins/workspace/Test_openjdk11_hs_extended.openjdk_x86-64_mac_rerun/aqa-tests/openjdk/openjdk-jdk/test/jdk/java/time/tck/java/time/format/TCKTextStyle.java /Users/jenkins/workspace/Test_openjdk11_hs_extended.openjdk_x86-64_mac_rerun/aqa-tests/openjdk/openjdk-jdk/test/jdk/java/time/tck/java/time/format/TCKSignStyle.java /Users/jenkins/workspace/Test_openjdk11_hs_extended.openjdk_x86-64_mac_rerun/aqa-tests/openjdk/openjdk-jdk/test/jdk/java/time/tck/java/time/format/TCKFormatStyle.java /Users/jenkins/workspace/Test_openjdk11_hs_extended.openjdk_x86-64_mac_rerun/aqa-tests/openjdk/openjdk-jdk/test/jdk/java/time/tck/java/time/format/TCKOffsetPrinterParser.java /Users/jenkins/workspace/Test_openjdk11_hs_extended.openjdk_x86-64_mac_rerun/aqa-tests/openjdk/openjdk-jdk/test/jdk/java/time/tck/java/time/format/TCKDTFParsedInstant.java /Users/jenkins/workspace/Test_openjdk11_hs_extended.openjdk_x86-64_mac_rerun/aqa-tests/openjdk/openjdk-jdk/test/jdk/java/time/tck/java/time/format/TCKDateTimeFormatters.java /Users/jenkins/workspace/Test_openjdk11_hs_extended.openjdk_x86-64_mac_rerun/aqa-tests/openjdk/openjdk-jdk/test/jdk/java/time/tck/java/time/format/TCKLocalizedPrinterParser.java /Users/jenkins/workspace/Test_openjdk11_hs_extended.openjdk_x86-64_mac_rerun/aqa-tests/openjdk/openjdk-jdk/test/jdk/java/time/tck/java/time/format/TCKChronoPrinterParser.java /Users/jenkins/workspace/Test_openjdk11_hs_extended.openjdk_x86-64_mac_rerun/aqa-tests/openjdk/openjdk-jdk/test/jdk/java/time/tck/java/time/format/TCKDecimalStyle.java /Users/jenkins/workspace/Test_openjdk11_hs_extended.openjdk_x86-64_mac_rerun/aqa-tests/openjdk/openjdk-jdk/test/jdk/java/time/tck/java/time/format/TCKLocalizedOffsetIdPrinterParser.java /Users/jenkins/workspace/Test_openjdk11_hs_extended.openjdk_x86-64_mac_rerun/aqa-tests/openjdk/openjdk-jdk/test/jdk/java/time/tck/java/time/format/TCKPadPrinterParser.java /Users/jenkins/workspace/Test_openjdk11_hs_extended.openjdk_x86-64_mac_rerun/aqa-tests/openjdk/openjdk-jdk/test/jdk/java/time/tck/java/time/format/TCKDateTimeFormatter.java /Users/jenkins/workspace/Test_openjdk11_hs_extended.openjdk_x86-64_mac_rerun/aqa-tests/openjdk/openjdk-jdk/test/jdk/java/time/tck/java/time/format/TCKLocalizedFieldPrinter.java /Users/jenkins/workspace/Test_openjdk11_hs_extended.openjdk_x86-64_mac_rerun/aqa-tests/openjdk/openjdk-jdk/test/jdk/java/time/tck/java/time/format/TCKDateTimeFormatterBuilder.java /Users/jenkins/workspace/Test_openjdk11_hs_extended.openjdk_x86-64_mac_rerun/aqa-tests/openjdk/openjdk-jdk/test/jdk/java/time/tck/java/time/format/TCKResolverStyle.java /Users/jenkins/workspace/Test_openjdk11_hs_extended.openjdk_x86-64_mac_rerun/aqa-tests/openjdk/openjdk-jdk/test/jdk/java/time/tck/java/time/format/TCKLocalizedFieldParser.java /Users/jenkins/workspace/Test_openjdk11_hs_extended.openjdk_x86-64_mac_rerun/aqa-tests/openjdk/openjdk-jdk/test/jdk/java/time/tck/java/time/format/TCKZoneIdPrinterParser.java /Users/jenkins/workspace/Test_openjdk11_hs_extended.openjdk_x86-64_mac_rerun/aqa-tests/openjdk/openjdk-jdk/test/jdk/java/time/tck/java/time/format/TCKInstantPrinterParser.java /Users/jenkins/workspace/Test_openjdk11_hs_extended.openjdk_x86-64_mac_rerun/aqa-tests/openjdk/openjdk-jdk/test/jdk/java/time/tck/java/time/format/TCKDateTimeParseResolver.java /Users/jenkins/workspace/Test_openjdk11_hs_extended.openjdk_x86-64_mac_rerun/aqa-tests/openjdk/openjdk-jdk/test/jdk/java/time/tck/java/time/format/TCKDateTimeTextPrinting.java /Users/jenkins/workspace/Test_openjdk11_hs_extended.openjdk_x86-64_mac_rerun/aqa-tests/openjdk/openjdk-jdk/test/jdk/java/time/tck/java/time/TCKClock_Fixed.java /Users/jenkins/workspace/Test_openjdk11_hs_extended.openjdk_x86-64_mac_rerun/aqa-tests/openjdk/openjdk-jdk/test/jdk/java/time/tck/java/time/TCKYear.java /Users/jenkins/workspace/Test_openjdk11_hs_extended.openjdk_x86-64_mac_rerun/aqa-tests/openjdk/openjdk-jdk/test/jdk/java/time/tck/java/time/TCKZoneOffset.java /Users/jenkins/workspace/Test_openjdk11_hs_extended.openjdk_x86-64_mac_rerun/aqa-tests/openjdk/openjdk-jdk/test/jdk/java/time/tck/java/time/TCKLocalDate.java /Users/jenkins/workspace/Test_openjdk11_hs_extended.openjdk_x86-64_mac_rerun/aqa-tests/openjdk/openjdk-jdk/test/jdk/java/time/tck/java/time/AbstractTCKTest.java /Users/jenkins/workspace/Test_openjdk11_hs_extended.openjdk_x86-64_mac_rerun/aqa-tests/openjdk/openjdk-jdk/test/jdk/java/time/tck/java/time/serial/TCKLocalDateTimeSerialization.java /Users/jenkins/workspace/Test_openjdk11_hs_extended.openjdk_x86-64_mac_rerun/aqa-tests/openjdk/openjdk-jdk/test/jdk/java/time/tck/java/time/serial/TCKDurationSerialization.java /Users/jenkins/workspace/Test_openjdk11_hs_extended.openjdk_x86-64_mac_rerun/aqa-tests/openjdk/openjdk-jdk/test/jdk/java/time/tck/java/time/serial/TCKPeriodSerialization.java /Users/jenkins/workspace/Test_openjdk11_hs_extended.openjdk_x86-64_mac_rerun/aqa-tests/openjdk/openjdk-jdk/test/jdk/java/time/tck/java/time/serial/TCKYearSerialization.java /Users/jenkins/workspace/Test_openjdk11_hs_extended.openjdk_x86-64_mac_rerun/aqa-tests/openjdk/openjdk-jdk/test/jdk/java/time/tck/java/time/serial/TCKZoneOffsetSerialization.java /Users/jenkins/workspace/Test_openjdk11_hs_extended.openjdk_x86-64_mac_rerun/aqa-tests/openjdk/openjdk-jdk/test/jdk/java/time/tck/java/time/serial/TCKZonedDateTimeSerialization.java /Users/jenkins/workspace/Test_openjdk11_hs_extended.openjdk_x86-64_mac_rerun/aqa-tests/openjdk/openjdk-jdk/test/jdk/java/time/tck/java/time/serial/TCKOffsetDateTimeSerialization.java /Users/jenkins/workspace/Test_openjdk11_hs_extended.openjdk_x86-64_mac_rerun/aqa-tests/openjdk/openjdk-jdk/test/jdk/java/time/tck/java/time/serial/TCKClockSerialization.java /Users/jenkins/workspace/Test_openjdk11_hs_extended.openjdk_x86-64_mac_rerun/aqa-tests/openjdk/openjdk-jdk/test/jdk/java/time/tck/java/time/serial/TCKLocalDateSerialization.java /Users/jenkins/workspace/Test_openjdk11_hs_extended.openjdk_x86-64_mac_rerun/aqa-tests/openjdk/openjdk-jdk/test/jdk/java/time/tck/java/time/serial/TCKYearMonthSerialization.java /Users/jenkins/workspace/Test_openjdk11_hs_extended.openjdk_x86-64_mac_rerun/aqa-tests/openjdk/openjdk-jdk/test/jdk/java/time/tck/java/time/serial/TCKZoneIdSerialization.java /Users/jenkins/workspace/Test_openjdk11_hs_extended.openjdk_x86-64_mac_rerun/aqa-tests/openjdk/openjdk-jdk/test/jdk/java/time/tck/java/time/serial/TCKInstantSerialization.java /Users/jenkins/workspace/Test_openjdk11_hs_extended.openjdk_x86-64_mac_rerun/aqa-tests/openjdk/openjdk-jdk/test/jdk/java/time/tck/java/time/serial/TCKLocalTimeSerialization.java /Users/jenkins/workspace/Test_openjdk11_hs_extended.openjdk_x86-64_mac_rerun/aqa-tests/openjdk/openjdk-jdk/test/jdk/java/time/tck/java/time/serial/TCKOffsetTimeSerialization.java /Users/jenkins/workspace/Test_openjdk11_hs_extended.openjdk_x86-64_mac_rerun/aqa-tests/openjdk/openjdk-jdk/test/jdk/java/time/tck/java/time/serial/TCKMonthDaySerialization.java /Users/jenkins/workspace/Test_openjdk11_hs_extended.openjdk_x86-64_mac_rerun/aqa-tests/openjdk/openjdk-jdk/test/jdk/java/time/tck/java/time/TCKOffsetDateTime.java /Users/jenkins/workspace/Test_openjdk11_hs_extended.openjdk_x86-64_mac_rerun/aqa-tests/openjdk/openjdk-jdk/test/jdk/java/time/tck/java/time/TCKPeriod.java /Users/jenkins/workspace/Test_openjdk11_hs_extended.openjdk_x86-64_mac_rerun/aqa-tests/openjdk/openjdk-jdk/test/jdk/java/time/nontestng/java/time/chrono/Bug8178823.java
[2024-11-14T12:26:14.500Z] reason: .class file out of date or does not exist
[2024-11-14T12:26:14.500Z] started: Thu Nov 14 12:26:00 GMT 2024
[2024-11-14T12:26:14.500Z] Additional options from @modules: --add-modules jdk.localedata
[2024-11-14T12:26:14.500Z] Mode: othervm
[2024-11-14T12:26:14.500Z] finished: Thu Nov 14 12:26:13 GMT 2024
[2024-11-14T12:26:14.500Z] elapsed time (seconds): 12.725
[2024-11-14T12:26:14.500Z] configuration:
[2024-11-14T12:26:14.500Z] javac compilation environment
[2024-11-14T12:26:14.500Z] add modules: jdk.localedata
[2024-11-14T12:26:14.500Z] source path: /Users/jenkins/workspace/Test_openjdk11_hs_extended.openjdk_x86-64_mac_rerun/aqa-tests/openjdk/openjdk-jdk/test/jdk/java/time
[2024-11-14T12:26:14.500Z] /Users/jenkins/workspace/Test_openjdk11_hs_extended.openjdk_x86-64_mac_rerun/aqa-tests/openjdk/openjdk-jdk/test/lib
[2024-11-14T12:26:14.500Z] class path: /Users/jenkins/workspace/Test_openjdk11_hs_extended.openjdk_x86-64_mac_rerun/aqa-tests/openjdk/openjdk-jdk/test/jdk/java/time
[2024-11-14T12:26:14.500Z] /Users/jenkins/workspace/Test_openjdk11_hs_extended.openjdk_x86-64_mac_rerun/aqa-tests/TKG/output_17315871514520/jdk_custom_0/work/classes/0/java/time
[2024-11-14T12:26:14.500Z] /Users/jenkins/workspace/Test_openjdk11_hs_extended.openjdk_x86-64_mac_rerun/aqa-tests/TKG/output_17315871514520/jdk_custom_0/work/classes/0/test/lib
[2024-11-14T12:26:14.500Z] /Users/jenkins/workspace/Test_openjdk11_hs_extended.openjdk_x86-64_mac_rerun/jvmtest/openjdk/jtreg/lib/testng-7.3.0.jar
[2024-11-14T12:26:14.500Z] /Users/jenkins/workspace/Test_openjdk11_hs_extended.openjdk_x86-64_mac_rerun/jvmtest/openjdk/jtreg/lib/guice-5.1.0.jar
[2024-11-14T12:26:14.500Z] /Users/jenkins/workspace/Test_openjdk11_hs_extended.openjdk_x86-64_mac_rerun/jvmtest/openjdk/jtreg/lib/jcommander-1.82.jar
[2024-11-14T12:26:14.500Z]
[2024-11-14T12:26:14.500Z] rerun:
[2024-11-14T12:26:14.500Z] cd /Users/jenkins/workspace/Test_openjdk11_hs_extended.openjdk_x86-64_mac_rerun/aqa-tests/TKG/output_17315871514520/jdk_custom_0/work/java/time/test/java/time/format/TestUTCParse && \
[2024-11-14T12:26:14.500Z] HOME=/Users/jenkins \
[2024-11-14T12:26:14.500Z] PATH=/bin:/usr/bin:/usr/sbin \
[2024-11-14T12:26:14.500Z] /Users/jenkins/workspace/Test_openjdk11_hs_extended.openjdk_x86-64_mac_rerun/jdkbinary/j2sdk-image/Contents/Home/bin/../bin/javac \
[2024-11-14T12:26:14.500Z] -J-ea \
[2024-11-14T12:26:14.500Z] -J-esa \
[2024-11-14T12:26:14.500Z] -J-Xmx512m \
[2024-11-14T12:26:14.500Z] -J-Dtest.vm.opts='-ea -esa -Xmx512m' \
[2024-11-14T12:26:14.500Z] -J-Dtest.tool.vm.opts='-J-ea -J-esa -J-Xmx512m' \
[2024-11-14T12:26:14.500Z] -J-Dtest.compiler.opts= \
[2024-11-14T12:26:14.500Z] -J-Dtest.java.opts= \
[2024-11-14T12:26:14.500Z] -J-Dtest.jdk=/Users/jenkins/workspace/Test_openjdk11_hs_extended.openjdk_x86-64_mac_rerun/jdkbinary/j2sdk-image/Contents/Home/bin/.. \
[2024-11-14T12:26:14.500Z] -J-Dcompile.jdk=/Users/jenkins/workspace/Test_openjdk11_hs_extended.openjdk_x86-64_mac_rerun/jdkbinary/j2sdk-image/Contents/Home/bin/.. \
[2024-11-14T12:26:14.500Z] -J-Dtest.timeout.factor=8.0 \
[2024-11-14T12:26:14.500Z] -J-Dtest.nativepath=/Users/jenkins/workspace/Test_openjdk11_hs_extended.openjdk_x86-64_mac_rerun/jdkbinary/openjdk-test-image/jdk/jtreg/native \
[2024-11-14T12:26:14.500Z] -J-Dtest.root=/Users/jenkins/workspace/Test_openjdk11_hs_extended.openjdk_x86-64_mac_rerun/aqa-tests/openjdk/openjdk-jdk/test/jdk \
[2024-11-14T12:26:14.500Z] -J-Dtest.name=java/time/test/java/time/format/TestUTCParse.java \
[2024-11-14T12:26:14.500Z] -J-Dtest.file=/Users/jenkins/workspace/Test_openjdk11_hs_extended.openjdk_x86-64_mac_rerun/aqa-tests/openjdk/openjdk-jdk/test/jdk/java/time/test/java/time/format/TestUTCParse.java \
[2024-11-14T12:26:14.500Z] -J-Dtest.src=/Users/jenkins/workspace/Test_openjdk11_hs_extended.openjdk_x86-64_mac_rerun/aqa-tests/openjdk/openjdk-jdk/test/jdk/java/time \
[2024-11-14T12:26:14.500Z] -J-Dtest.src.path=/Users/jenkins/workspace/Test_openjdk11_hs_extended.openjdk_x86-64_mac_rerun/aqa-tests/openjdk/openjdk-jdk/test/jdk/java/time:/Users/jenkins/workspace/Test_openjdk11_hs_extended.openjdk_x86-64_mac_rerun/aqa-tests/openjdk/openjdk-jdk/test/lib \
[2024-11-14T12:26:14.500Z] -J-Dtest.classes=/Users/jenkins/workspace/Test_openjdk11_hs_extended.openjdk_x86-64_mac_rerun/aqa-tests/TKG/output_17315871514520/jdk_custom_0/work/classes/0/java/time \
[2024-11-14T12:26:14.500Z] -J-Dtest.class.path=/Users/jenkins/workspace/Test_openjdk11_hs_extended.openjdk_x86-64_mac_rerun/aqa-tests/TKG/output_17315871514520/jdk_custom_0/work/classes/0/java/time:/Users/jenkins/workspace/Test_openjdk11_hs_extended.openjdk_x86-64_mac_rerun/aqa-tests/TKG/output_17315871514520/jdk_custom_0/work/classes/0/test/lib \
[2024-11-14T12:26:14.500Z] -J-Dtest.modules=jdk.localedata \
[2024-11-14T12:26:14.500Z] @/Users/jenkins/workspace/Test_openjdk11_hs_extended.openjdk_x86-64_mac_rerun/aqa-tests/TKG/output_17315871514520/jdk_custom_0/work/java/time/test/java/time/format/TestUTCParse.d/compile.1.jta
[2024-11-14T12:26:14.500Z] STDOUT:
[2024-11-14T12:26:14.500Z] STDERR:
[2024-11-14T12:26:14.500Z]
[2024-11-14T12:26:14.500Z] ACTION: testng -- Failed. Execution failed: `main' threw exception: java.lang.Exception: failures: 1
[2024-11-14T12:26:14.500Z] REASON: Assumed action based on file name: run testng test.java.time.format.TestUTCParse
[2024-11-14T12:26:14.500Z] TIME: 0.663 seconds
[2024-11-14T12:26:14.500Z] messages:
[2024-11-14T12:26:14.500Z] command: testng test.java.time.format.TestUTCParse
[2024-11-14T12:26:14.500Z] reason: Assumed action based on file name: run testng test.java.time.format.TestUTCParse
[2024-11-14T12:26:14.500Z] started: Thu Nov 14 12:26:13 GMT 2024
[2024-11-14T12:26:14.500Z] Mode: othervm
[2024-11-14T12:26:14.500Z] Additional options from @modules: --add-modules jdk.localedata
[2024-11-14T12:26:14.500Z] finished: Thu Nov 14 12:26:13 GMT 2024
[2024-11-14T12:26:14.500Z] elapsed time (seconds): 0.663
[2024-11-14T12:26:14.500Z] configuration:
[2024-11-14T12:26:14.500Z] Boot Layer
[2024-11-14T12:26:14.500Z] add modules: jdk.localedata
[2024-11-14T12:26:14.500Z]
[2024-11-14T12:26:14.500Z] STDOUT:
[2024-11-14T12:26:14.500Z] test test.java.time.format.TestUTCParse.testUTCOffsetRoundTrip("UTC"): success
[2024-11-14T12:26:14.500Z] test test.java.time.format.TestUTCParse.testUTCOffsetRoundTrip("UTC+01:30"): success
[2024-11-14T12:26:14.500Z] test test.java.time.format.TestUTCParse.testUTCOffsetRoundTrip("UTC-01:30"): success
[2024-11-14T12:26:14.500Z] test test.java.time.format.TestUTCParse.testUTCShortNameRoundTrip(): failure
[2024-11-14T12:26:14.500Z] java.lang.AssertionError: expected [UTC−08:00] but found [PST]
[2024-11-14T12:26:14.500Z] at org.testng.Assert.fail(Assert.java:99)
[2024-11-14T12:26:14.500Z] at org.testng.Assert.failNotEquals(Assert.java:1037)
[2024-11-14T12:26:14.500Z] at org.testng.Assert.assertEqualsImpl(Assert.java:140)
[2024-11-14T12:26:14.500Z] at org.testng.Assert.assertEquals(Assert.java:122)
[2024-11-14T12:26:14.500Z] at org.testng.Assert.assertEquals(Assert.java:629)
[2024-11-14T12:26:14.500Z] at org.testng.Assert.assertEquals(Assert.java:639)
[2024-11-14T12:26:14.500Z] at test.java.time.format.TestUTCParse.testUTCShortNameRoundTrip(TestUTCParse.java:65)
[2024-11-14T12:26:14.500Z] at java.base/jdk.internal.reflect.NativeMethodAccessorImpl.invoke0(Native Method)
[2024-11-14T12:26:14.500Z] at java.base/jdk.internal.reflect.NativeMethodAccessorImpl.invoke(NativeMethodAccessorImpl.java:62)
[2024-11-14T12:26:14.500Z] at java.base/jdk.internal.reflect.DelegatingMethodAccessorImpl.invoke(DelegatingMethodAccessorImpl.java:43)
[2024-11-14T12:26:14.500Z] at java.base/java.lang.reflect.Method.invoke(Method.java:566)
[2024-11-14T12:26:14.500Z] at org.testng.internal.MethodInvocationHelper.invokeMethod(MethodInvocationHelper.java:132)
[2024-11-14T12:26:14.500Z] at org.testng.internal.TestInvoker.invokeMethod(TestInvoker.java:599)
[2024-11-14T12:26:14.500Z] at org.testng.internal.TestInvoker.invokeTestMethod(TestInvoker.java:174)
[2024-11-14T12:26:14.500Z] at org.testng.internal.MethodRunner.runInSequence(MethodRunner.java:46)
[2024-11-14T12:26:14.500Z] at org.testng.internal.TestInvoker$MethodInvocationAgent.invoke(TestInvoker.java:822)
[2024-11-14T12:26:14.500Z] at org.testng.internal.TestInvoker.invokeTestMethods(TestInvoker.java:147)
[2024-11-14T12:26:14.500Z] at org.testng.internal.TestMethodWorker.invokeTestMethods(TestMethodWorker.java:146)
[2024-11-14T12:26:14.500Z] at org.testng.internal.TestMethodWorker.run(TestMethodWorker.java:128)
[2024-11-14T12:26:14.500Z] at java.base/java.util.ArrayList.forEach(ArrayList.java:1541)
[2024-11-14T12:26:14.500Z] at org.testng.TestRunner.privateRun(TestRunner.java:764)
[2024-11-14T12:26:14.500Z] at org.testng.TestRunner.run(TestRunner.java:585)
[2024-11-14T12:26:14.500Z] at org.testng.SuiteRunner.runTest(SuiteRunner.java:384)
[2024-11-14T12:26:14.500Z] at org.testng.SuiteRunner.runSequentially(SuiteRunner.java:378)
[2024-11-14T12:26:14.500Z] at org.testng.SuiteRunner.privateRun(SuiteRunner.java:337)
[2024-11-14T12:26:14.500Z] at org.testng.SuiteRunner.run(SuiteRunner.java:286)
[2024-11-14T12:26:14.500Z] at org.testng.SuiteRunnerWorker.runSuite(SuiteRunnerWorker.java:53)
[2024-11-14T12:26:14.500Z] at org.testng.SuiteRunnerWorker.run(SuiteRunnerWorker.java:96)
[2024-11-14T12:26:14.500Z] at org.testng.TestNG.runSuitesSequentially(TestNG.java:1218)
[2024-11-14T12:26:14.500Z] at org.testng.TestNG.runSuitesLocally(TestNG.java:1140)
[2024-11-14T12:26:14.500Z] at org.testng.TestNG.runSuites(TestNG.java:1069)
[2024-11-14T12:26:14.500Z] at org.testng.TestNG.run(TestNG.java:1037)
[2024-11-14T12:26:14.500Z] at com.sun.javatest.regtest.agent.TestNGRunner.main(TestNGRunner.java:102)
[2024-11-14T12:26:14.500Z] at com.sun.javatest.regtest.agent.TestNGRunner.main(TestNGRunner.java:58)
[2024-11-14T12:26:14.500Z] at java.base/jdk.internal.reflect.NativeMethodAccessorImpl.invoke0(Native Method)
[2024-11-14T12:26:14.500Z] at java.base/jdk.internal.reflect.NativeMethodAccessorImpl.invoke(NativeMethodAccessorImpl.java:62)
[2024-11-14T12:26:14.500Z] at java.base/jdk.internal.reflect.DelegatingMethodAccessorImpl.invoke(DelegatingMethodAccessorImpl.java:43)
[2024-11-14T12:26:14.500Z] at java.base/java.lang.reflect.Method.invoke(Method.java:566)
[2024-11-14T12:26:14.500Z] at com.sun.javatest.regtest.agent.MainWrapper$MainTask.run(MainWrapper.java:138)
[2024-11-14T12:26:14.500Z] at java.base/java.lang.Thread.run(Thread.java:829)
[2024-11-14T12:26:14.500Z]
[2024-11-14T12:26:14.500Z] ===============================================
[2024-11-14T12:26:14.500Z] java/time/test/java/time/format/TestUTCParse.java
[2024-11-14T12:26:14.500Z] Total tests run: 4, Passes: 3, Failures: 1, Skips: 0
[2024-11-14T12:26:14.500Z] ===============================================
[2024-11-14T12:26:14.500Z]
[2024-11-14T12:26:14.500Z] STDERR:
[2024-11-14T12:26:14.500Z] java.lang.Exception: failures: 1
[2024-11-14T12:26:14.500Z] at com.sun.javatest.regtest.agent.TestNGRunner.main(TestNGRunner.java:104)
[2024-11-14T12:26:14.500Z] at com.sun.javatest.regtest.agent.TestNGRunner.main(TestNGRunner.java:58)
[2024-11-14T12:26:14.500Z] at java.base/jdk.internal.reflect.NativeMethodAccessorImpl.invoke0(Native Method)
[2024-11-14T12:26:14.500Z] at java.base/jdk.internal.reflect.NativeMethodAccessorImpl.invoke(NativeMethodAccessorImpl.java:62)
[2024-11-14T12:26:14.500Z] at java.base/jdk.internal.reflect.DelegatingMethodAccessorImpl.invoke(DelegatingMethodAccessorImpl.java:43)
[2024-11-14T12:26:14.500Z] at java.base/java.lang.reflect.Method.invoke(Method.java:566)
[2024-11-14T12:26:14.500Z] at com.sun.javatest.regtest.agent.MainWrapper$MainTask.run(MainWrapper.java:138)
[2024-11-14T12:26:14.500Z] at java.base/java.lang.Thread.run(Thread.java:829)
[2024-11-14T12:26:14.500Z]
[2024-11-14T12:26:14.500Z] JavaTest Message: Test threw exception: java.lang.Exception: failures: 1
[2024-11-14T12:26:14.500Z] JavaTest Message: shutting down test
[2024-11-14T12:26:14.500Z]
[2024-11-14T12:26:14.500Z] STATUS:Failed.`main' threw exception: java.lang.Exception: failures: 1
[2024-11-14T12:26:14.500Z] rerun:
[2024-11-14T12:26:14.500Z] cd /Users/jenkins/workspace/Test_openjdk11_hs_extended.openjdk_x86-64_mac_rerun/aqa-tests/TKG/output_17315871514520/jdk_custom_0/work/java/time/test/java/time/format/TestUTCParse && \
[2024-11-14T12:26:14.500Z] HOME=/Users/jenkins \
[2024-11-14T12:26:14.500Z] PATH=/bin:/usr/bin:/usr/sbin \
[2024-11-14T12:26:14.500Z] CLASSPATH=/Users/jenkins/workspace/Test_openjdk11_hs_extended.openjdk_x86-64_mac_rerun/aqa-tests/TKG/output_17315871514520/jdk_custom_0/work/classes/0/java/time:/Users/jenkins/workspace/Test_openjdk11_hs_extended.openjdk_x86-64_mac_rerun/aqa-tests/openjdk/openjdk-jdk/test/jdk/java/time:/Users/jenkins/workspace/Test_openjdk11_hs_extended.openjdk_x86-64_mac_rerun/aqa-tests/TKG/output_17315871514520/jdk_custom_0/work/classes/0/test/lib:/Users/jenkins/workspace/Test_openjdk11_hs_extended.openjdk_x86-64_mac_rerun/aqa-tests/openjdk/openjdk-jdk/test/lib:/Users/jenkins/workspace/Test_openjdk11_hs_extended.openjdk_x86-64_mac_rerun/jvmtest/openjdk/jtreg/lib/testng-7.3.0.jar:/Users/jenkins/workspace/Test_openjdk11_hs_extended.openjdk_x86-64_mac_rerun/jvmtest/openjdk/jtreg/lib/guice-5.1.0.jar:/Users/jenkins/workspace/Test_openjdk11_hs_extended.openjdk_x86-64_mac_rerun/jvmtest/openjdk/jtreg/lib/jcommander-1.82.jar:/Users/jenkins/workspace/Test_openjdk11_hs_extended.openjdk_x86-64_mac_rerun/jvmtest/openjdk/jtreg/lib/javatest.jar:/Users/jenkins/workspace/Test_openjdk11_hs_extended.openjdk_x86-64_mac_rerun/jvmtest/openjdk/jtreg/lib/jtreg.jar \
[2024-11-14T12:26:14.501Z] /Users/jenkins/workspace/Test_openjdk11_hs_extended.openjdk_x86-64_mac_rerun/jdkbinary/j2sdk-image/Contents/Home/bin/../bin/java \
[2024-11-14T12:26:14.501Z] -Dtest.vm.opts='-ea -esa -Xmx512m' \
[2024-11-14T12:26:14.501Z] -Dtest.tool.vm.opts='-J-ea -J-esa -J-Xmx512m' \
[2024-11-14T12:26:14.501Z] -Dtest.compiler.opts= \
[2024-11-14T12:26:14.501Z] -Dtest.java.opts= \
[2024-11-14T12:26:14.501Z] -Dtest.jdk=/Users/jenkins/workspace/Test_openjdk11_hs_extended.openjdk_x86-64_mac_rerun/jdkbinary/j2sdk-image/Contents/Home/bin/.. \
[2024-11-14T12:26:14.501Z] -Dcompile.jdk=/Users/jenkins/workspace/Test_openjdk11_hs_extended.openjdk_x86-64_mac_rerun/jdkbinary/j2sdk-image/Contents/Home/bin/.. \
[2024-11-14T12:26:14.501Z] -Dtest.timeout.factor=8.0 \
[2024-11-14T12:26:14.501Z] -Dtest.nativepath=/Users/jenkins/workspace/Test_openjdk11_hs_extended.openjdk_x86-64_mac_rerun/jdkbinary/openjdk-test-image/jdk/jtreg/native \
[2024-11-14T12:26:14.501Z] -Dtest.root=/Users/jenkins/workspace/Test_openjdk11_hs_extended.openjdk_x86-64_mac_rerun/aqa-tests/openjdk/openjdk-jdk/test/jdk \
[2024-11-14T12:26:14.501Z] -Dtest.name=java/time/test/java/time/format/TestUTCParse.java \
[2024-11-14T12:26:14.501Z] -Dtest.file=/Users/jenkins/workspace/Test_openjdk11_hs_extended.openjdk_x86-64_mac_rerun/aqa-tests/openjdk/openjdk-jdk/test/jdk/java/time/test/java/time/format/TestUTCParse.java \
[2024-11-14T12:26:14.501Z] -Dtest.src=/Users/jenkins/workspace/Test_openjdk11_hs_extended.openjdk_x86-64_mac_rerun/aqa-tests/openjdk/openjdk-jdk/test/jdk/java/time \
[2024-11-14T12:26:14.501Z] -Dtest.src.path=/Users/jenkins/workspace/Test_openjdk11_hs_extended.openjdk_x86-64_mac_rerun/aqa-tests/openjdk/openjdk-jdk/test/jdk/java/time:/Users/jenkins/workspace/Test_openjdk11_hs_extended.openjdk_x86-64_mac_rerun/aqa-tests/openjdk/openjdk-jdk/test/lib \
[2024-11-14T12:26:14.501Z] -Dtest.classes=/Users/jenkins/workspace/Test_openjdk11_hs_extended.openjdk_x86-64_mac_rerun/aqa-tests/TKG/output_17315871514520/jdk_custom_0/work/classes/0/java/time \
[2024-11-14T12:26:14.501Z] -Dtest.class.path=/Users/jenkins/workspace/Test_openjdk11_hs_extended.openjdk_x86-64_mac_rerun/aqa-tests/TKG/output_17315871514520/jdk_custom_0/work/classes/0/java/time:/Users/jenkins/workspace/Test_openjdk11_hs_extended.openjdk_x86-64_mac_rerun/aqa-tests/TKG/output_17315871514520/jdk_custom_0/work/classes/0/test/lib \
[2024-11-14T12:26:14.501Z] -Dtest.modules=jdk.localedata \
[2024-11-14T12:26:14.501Z] --add-modules jdk.localedata \
[2024-11-14T12:26:14.501Z] -ea \
[2024-11-14T12:26:14.501Z] -esa \
[2024-11-14T12:26:14.501Z] -Xmx512m \
[2024-11-14T12:26:14.501Z] -Djava.library.path=/Users/jenkins/workspace/Test_openjdk11_hs_extended.openjdk_x86-64_mac_rerun/jdkbinary/openjdk-test-image/jdk/jtreg/native \
[2024-11-14T12:26:14.501Z] com.sun.javatest.regtest.agent.MainWrapper /Users/jenkins/workspace/Test_openjdk11_hs_extended.openjdk_x86-64_mac_rerun/aqa-tests/TKG/output_17315871514520/jdk_custom_0/work/java/time/test/java/time/format/TestUTCParse.d/testng.2.jta java/time/test/java/time/format/TestUTCParse.java false test.java.time.format.TestUTCParse
[2024-11-14T12:26:14.501Z]
[2024-11-14T12:26:14.501Z] TEST RESULT: Failed. Execution failed: `main' threw exception: java.lang.Exception: failures: 1
[2024-11-14T12:26:14.501Z] --------------------------------------------------
[2024-11-14T12:26:14.501Z] Test results: passed: 1; failed: 1
[2024-11-14T12:26:23.809Z] Report written to /Users/jenkins/workspace/Test_openjdk11_hs_extended.openjdk_x86-64_mac_rerun/aqa-tests/TKG/output_17315871514520/jdk_custom_0/report/html/report.html
[2024-11-14T12:26:23.809Z] Results written to /Users/jenkins/workspace/Test_openjdk11_hs_extended.openjdk_x86-64_mac_rerun/aqa-tests/TKG/output_17315871514520/jdk_custom_0/work
[2024-11-14T12:26:23.809Z] Error: Some tests failed or other problems occurred.
[2024-11-14T12:26:23.809Z] -----------------------------------
[2024-11-14T12:26:23.809Z] jdk_custom_0_FAILED
[2024-11-14T12:26:23.809Z] -----------------------------------
[2024-11-14T12:26:23.809Z]
[2024-11-14T12:26:23.809Z] TEST TEARDOWN:
[2024-11-14T12:26:23.809Z] Nothing to be done for teardown.
[2024-11-14T12:26:23.809Z] jdk_custom_0 Finish Time: Thu Nov 14 12:26:22 2024 Epoch Time (ms): 1731587182997