MathLoadTest_bigdecimal_5m_0
[2025-07-02T14:35:08.057Z] Running test MathLoadTest_bigdecimal_5m_0 ...
[2025-07-02T14:35:08.057Z] ===============================================
[2025-07-02T14:35:08.057Z] MathLoadTest_bigdecimal_5m_0 Start Time: Wed Jul 2 14:35:07 2025 Epoch Time (ms): 1751466907949
[2025-07-02T14:35:08.057Z] variation: Mode150
[2025-07-02T14:35:08.057Z] JVM_OPTIONS: -XX:+UseCompressedOops
[2025-07-02T14:35:08.057Z] { \
[2025-07-02T14:35:08.057Z] echo ""; echo "TEST SETUP:"; \
[2025-07-02T14:35:08.057Z] echo "Nothing to be done for setup."; \
[2025-07-02T14:35:08.057Z] mkdir -p "/home/jenkins/workspace/Test_openjdk17_hs_sanity.system_ppc64le_linux_testList_1/aqa-tests/TKG/../TKG/output_17514645295215/MathLoadTest_bigdecimal_5m_0"; \
[2025-07-02T14:35:08.057Z] cd "/home/jenkins/workspace/Test_openjdk17_hs_sanity.system_ppc64le_linux_testList_1/aqa-tests/TKG/../TKG/output_17514645295215/MathLoadTest_bigdecimal_5m_0"; \
[2025-07-02T14:35:08.057Z] echo ""; echo "TESTING:"; \
[2025-07-02T14:35:08.057Z] perl /home/jenkins/workspace/Test_openjdk17_hs_sanity.system_ppc64le_linux_testList_1/aqa-tests/TKG/../../jvmtest/system/mathLoadTest/..//STF/stf.core/scripts/stf.pl -test-root="/home/jenkins/workspace/Test_openjdk17_hs_sanity.system_ppc64le_linux_testList_1/aqa-tests/TKG/../../jvmtest/system/mathLoadTest/..//STF;/home/jenkins/workspace/Test_openjdk17_hs_sanity.system_ppc64le_linux_testList_1/aqa-tests/TKG/../../jvmtest/system/mathLoadTest/..//aqa-systemtest""" -systemtest-prereqs="/home/jenkins/workspace/Test_openjdk17_hs_sanity.system_ppc64le_linux_testList_1/../../testDependency/system_lib/" -java-args=' -XX:+UseCompressedOops ' -results-root="/home/jenkins/workspace/Test_openjdk17_hs_sanity.system_ppc64le_linux_testList_1/aqa-tests/TKG/../TKG/output_17514645295215/MathLoadTest_bigdecimal_5m_0" -test=MathLoadTest -test-args="timeLimit=5m,workload=bigDecimal"; \
[2025-07-02T14:35:08.057Z] if [ $? -eq 0 ]; then echo "-----------------------------------"; echo "MathLoadTest_bigdecimal_5m_0""_PASSED"; echo "-----------------------------------"; cd /home/jenkins/workspace/Test_openjdk17_hs_sanity.system_ppc64le_linux_testList_1/aqa-tests/TKG/..; rm -f -r "/home/jenkins/workspace/Test_openjdk17_hs_sanity.system_ppc64le_linux_testList_1/aqa-tests/TKG/../TKG/output_17514645295215/MathLoadTest_bigdecimal_5m_0"; else echo "-----------------------------------"; echo "MathLoadTest_bigdecimal_5m_0""_FAILED"; echo "-----------------------------------"; fi; \
[2025-07-02T14:35:08.057Z] echo ""; echo "TEST TEARDOWN:"; \
[2025-07-02T14:35:08.057Z] echo "Nothing to be done for teardown."; \
[2025-07-02T14:35:08.057Z] } 2>&1 | tee -a "/home/jenkins/workspace/Test_openjdk17_hs_sanity.system_ppc64le_linux_testList_1/aqa-tests/TKG/../TKG/output_17514645295215/TestTargetResult";
[2025-07-02T14:35:08.057Z]
[2025-07-02T14:35:08.057Z] TEST SETUP:
[2025-07-02T14:35:08.057Z] Nothing to be done for setup.
[2025-07-02T14:35:08.057Z]
[2025-07-02T14:35:08.057Z] TESTING:
Calling Pipeline was cancelled
[2025-07-02T14:35:08.457Z] Sending interrupt signal to process
[2025-07-02T14:35:09.012Z] STF 14:35:08.051 - ========================= S T F =========================
[2025-07-02T14:35:09.012Z] systemtest-prereqs has been processed, and set to: /home/jenkins/testDependency/system_libRetrieving amount of free space on drive containing /home/jenkins/workspace/Test_openjdk17_hs_sanity.system_ppc64le_linux_testList_1/aqa-tests/TKG/../TKG/output_17514645295215/MathLoadTest_bigdecimal_5m_0
[2025-07-02T14:35:09.012Z] There is 57485 Mb free
[2025-07-02T14:35:09.012Z] STF 14:35:08.061 - ================== G E N E R A T I O N ==================
[2025-07-02T14:35:09.012Z] STF 14:35:08.062 - Checking JVM: /home/jenkins/workspace/Test_openjdk17_hs_sanity.system_ppc64le_linux_testList_1/jdkbinary/j2sdk-image
[2025-07-02T14:35:09.012Z] STF 14:35:08.062 - Starting process to generate scripts: /home/jenkins/workspace/Test_openjdk17_hs_sanity.system_ppc64le_linux_testList_1/jdkbinary/j2sdk-image/bin/java -Dlog4j.skipJansi=true -Djava.system.class.loader=net.adoptopenjdk.stf.runner.StfClassLoader -Dload.agent.path=/home/jenkins/workspace/Test_openjdk17_hs_sanity.system_ppc64le_linux_testList_1/jvmtest/system/STF/stf.core/scripts/../../stf.load/bin/stf.load.jar -classpath /home/jenkins/workspace/Test_openjdk17_hs_sanity.system_ppc64le_linux_testList_1/../../testDependency/system_lib//asm/asm.jar:/home/jenkins/workspace/Test_openjdk17_hs_sanity.system_ppc64le_linux_testList_1/../../testDependency/system_lib//asm/asm-commons.jar:/home/jenkins/workspace/Test_openjdk17_hs_sanity.system_ppc64le_linux_testList_1/../../testDependency/system_lib//log4j/log4j-api.jar:/home/jenkins/workspace/Test_openjdk17_hs_sanity.system_ppc64le_linux_testList_1/../../testDependency/system_lib//log4j/log4j-core.jar:/home/jenkins/workspace/Test_openjdk17_hs_sanity.system_ppc64le_linux_testList_1/jvmtest/system/STF/stf.core/scripts/../bin net.adoptopenjdk.stf.runner.StfRunner -properties "/home/jenkins/workspace/Test_openjdk17_hs_sanity.system_ppc64le_linux_testList_1/aqa-tests/TKG/../TKG/output_17514645295215/MathLoadTest_bigdecimal_5m_0/20250702-143508-MathLoadTest/stf_parameters.properties, , /home/jenkins/workspace/Test_openjdk17_hs_sanity.system_ppc64le_linux_testList_1/jvmtest/system/STF/stf.core/config/stf.properties" -testDir "/home/jenkins/workspace/Test_openjdk17_hs_sanity.system_ppc64le_linux_testList_1/aqa-tests/TKG/../TKG/output_17514645295215/MathLoadTest_bigdecimal_5m_0/20250702-143508-MathLoadTest"
[2025-07-02T14:35:09.012Z] GEN stderr OpenJDK 64-Bit Server VM warning: Archived non-system classes are disabled because the java.system.class.loader property is specified (value = "net.adoptopenjdk.stf.runner.StfClassLoader"). To use archived non-system classes, this property must not be set
[2025-07-02T14:35:09.012Z] make[5]: *** [autoGen.mk:105: MathLoadTest_bigdecimal_5m_0] Error 143
[2025-07-02T14:35:09.012Z] make[5]: Leaving directory '/home/jenkins/workspace/Test_openjdk17_hs_sanity.system_ppc64le_linux_testList_1/aqa-tests/system/mathLoadTest'
[2025-07-02T14:35:09.012Z] make[4]: *** [/home/jenkins/workspace/Test_openjdk17_hs_sanity.system_ppc64le_linux_testList_1/aqa-tests/TKG/../TKG/settings.mk:362: testList-mathLoadTest] Error 2
[2025-07-02T14:35:09.012Z] make[4]: Leaving directory '/home/jenkins/workspace/Test_openjdk17_hs_sanity.system_ppc64le_linux_testList_1/aqa-tests/system'
[2025-07-02T14:35:09.012Z] make[3]: *** [/home/jenkins/workspace/Test_openjdk17_hs_sanity.system_ppc64le_linux_testList_1/aqa-tests/TKG/../TKG/settings.mk:362: testList-system] Error 2
[2025-07-02T14:35:09.012Z] make[3]: Leaving directory '/home/jenkins/workspace/Test_openjdk17_hs_sanity.system_ppc64le_linux_testList_1/aqa-tests'
[2025-07-02T14:35:09.012Z] make[2]: *** [settings.mk:362: testList-..] Error 2
[2025-07-02T14:35:09.012Z] make[2]: Leaving directory '/home/jenkins/workspace/Test_openjdk17_hs_sanity.system_ppc64le_linux_testList_1/aqa-tests/TKG'
[2025-07-02T14:35:09.012Z] make[1]: *** [makefile:62: _testList] Error 2
[2025-07-02T14:35:09.012Z] make[1]: Leaving directory '/home/jenkins/workspace/Test_openjdk17_hs_sanity.system_ppc64le_linux_testList_1/aqa-tests/TKG'
[2025-07-02T14:35:09.012Z] make: *** [parallelList.mk:11: testList_1] Error 2
[2025-07-02T14:35:09.558Z] script returned exit code 2
[Pipeline] sh
[2025-07-02T14:35:11.468Z] ++ uname
[2025-07-02T14:35:11.468Z] + '[' Linux = AIX ']'
[2025-07-02T14:35:11.468Z] ++ uname
[2025-07-02T14:35:11.468Z] + '[' Linux = SunOS ']'
[2025-07-02T14:35:11.468Z] ++ uname
[2025-07-02T14:35:11.468Z] + '[' Linux = '*BSD' ']'
[2025-07-02T14:35:11.468Z] + MAKE=make
[2025-07-02T14:35:11.468Z] + make -f ./aqa-tests/TKG/testEnv.mk testEnvTeardown
[2025-07-02T14:35:11.468Z] make: Nothing to be done for 'testEnvTeardown'.
[Pipeline] }
[2025-07-02T14:35:12.069Z] $ ssh-agent -k
[2025-07-02T14:35:12.080Z] unset SSH_AUTH_SOCK;
[2025-07-02T14:35:12.080Z] unset SSH_AGENT_PID;
[2025-07-02T14:35:12.080Z] echo Agent pid 2492950 killed;
[2025-07-02T14:35:12.869Z] [ssh-agent] Stopped.
[Pipeline] // sshagent
[Pipeline] }
[2025-07-02T14:35:12.910Z] Xvfb stopping
[Pipeline] // wrap
[Pipeline] echo
[2025-07-02T14:35:13.572Z] Could not find test result, set build result to FAILURE.
[Pipeline] }
[Pipeline] // stage
[Pipeline] stage
[Pipeline] { (Post)
[Pipeline] step
[2025-07-02T14:35:13.830Z] TAP Reports Processing: START
[2025-07-02T14:35:13.831Z] Looking for TAP results report in workspace using pattern: aqa-tests/TKG/**/*.tap
[2025-07-02T14:35:14.009Z] Did not find any matching files. Setting build result to FAILURE.
[Pipeline] echo
[2025-07-02T14:35:14.021Z] Saving aqa-tests/testenv/testenv.properties file on jenkins.
[Pipeline] archiveArtifacts
[2025-07-02T14:35:14.208Z] Archiving artifacts
[2025-07-02T14:35:14.627Z] Recording fingerprints
[Pipeline] echo
[2025-07-02T14:35:14.819Z] Saving aqa-tests/TKG/**/*.tap file on jenkins.
[Pipeline] archiveArtifacts
[2025-07-02T14:35:15.003Z] Archiving artifacts
[Pipeline] sh
[2025-07-02T14:35:17.066Z] + tar -cf - ./aqa-tests/TKG/output_17514645295215
[2025-07-02T14:35:17.067Z] + pigz -9
[Pipeline] echo
[2025-07-02T14:35:17.597Z] ARTIFACTORY_SERVER is not set. Saving artifacts on jenkins.
[Pipeline] archiveArtifacts
[2025-07-02T14:35:17.781Z] Archiving artifacts
[2025-07-02T14:35:18.482Z] Recording fingerprints
[Pipeline] findFiles
[Pipeline] junit
[2025-07-02T14:35:19.432Z] Recording test results
[2025-07-02T14:35:19.899Z] [Checks API] No suitable checks publisher found.
[Pipeline] }
[Pipeline] // stage
[Pipeline] echo
[2025-07-02T14:35:19.928Z] PROCESSCATCH: Terminating any hung/left over test processes:
[Pipeline] sh
[2025-07-02T14:35:19.778Z] No test report files were found. Configuration error?
[2025-07-02T14:35:21.940Z] + aqa-tests/terminateTestProcesses.sh jenkins
[2025-07-02T14:35:21.940Z] Unix type machine..
[2025-07-02T14:35:21.940Z] egrep: warning: egrep is obsolescent; using grep -E
[2025-07-02T14:35:21.940Z] grep: warning: stray \ before /
[2025-07-02T14:35:21.940Z] grep: warning: stray \ before /
[2025-07-02T14:35:21.940Z] Running on a Linux host
[2025-07-02T14:35:21.940Z] egrep: warning: egrep is obsolescent; using grep -E
[2025-07-02T14:35:21.940Z] egrep: warning: egrep is obsolescent; using grep -E
[2025-07-02T14:35:21.940Z] egrep: warning: egrep is obsolescent; using grep -E
[2025-07-02T14:35:21.940Z] grep: warning: stray \ before /
[2025-07-02T14:35:21.940Z] Woohoo - no rogue processes detected!
[Pipeline] cleanWs
[2025-07-02T14:35:22.821Z] [WS-CLEANUP] Deleting project workspace...
[2025-07-02T14:35:22.821Z] [WS-CLEANUP] Deferred wipeout is disabled by the job configuration...
Click here to forcibly terminate running steps
[2025-07-02T14:35:24.576Z] [WS-CLEANUP] done
[Pipeline] sh
[2025-07-02T14:35:26.578Z] + find /tmp -name '*core*' -print -exec rm -f '{}' ';'
[Pipeline] }
[Pipeline] // timeout
[Pipeline] timeout
[2025-07-02T14:35:32.664Z] Timeout set to expire in 5 min 0 sec
[Pipeline] {
[Pipeline] echo
[2025-07-02T14:35:32.698Z] Test_openjdk17_hs_sanity.system_ppc64le_linux_testList_1 #34 result is FAILURE. Checking console log for specific errors...
[Pipeline] }
[Pipeline] // timeout
[Pipeline] }
[Pipeline] // node
[Pipeline] }
[Pipeline] // stage
[Pipeline] }
[Pipeline] // timestamps
[Pipeline] End of Pipeline
Finished: ABORTED